7,7-Dimethyl-bicyclo[2.2.1]heptane
- Formula: C9H16
- Molecular weight: 124.2233
- IUPAC Standard InChIKey: NGSMAXPULGPQNT-UHFFFAOYSA-N
- CAS Registry Number: 2034-53-9
- Chemical structure:
View 3d structure (requires JavaScript / HTML 5) - Permanent link for this species. Use this link for bookmarking this species for future reference.

Condensed phase thermochemistry data

Data compiled by: Hussein Y. Afeefy, Joel F. Liebman, and Stephen E. Stein
Quantity | Value | Units | Method | Reference | Comment |
---|---|---|---|---|---|
ΔfH°solid | -148.3 ± 1.6 | kJ/mol | Ccb | Kozina, Bychikhina, et al., 1975 | |
Quantity | Value | Units | Method | Reference | Comment |
ΔcH°solid | -5680.0 ± 1.5 | kJ/mol | Ccb | Kozina, Bychikhina, et al., 1975 | Corresponding ΔfHºsolid = -148.2 kJ/mol (simple calculation by NIST; no Washburn corrections) |

Phase change data

Data compiled by: Thermodynamics Research Center, NIST Boulder Laboratories, Chris Muzny director
Quantity | Value | Units | Method | Reference | Comment |
---|---|---|---|---|---|
Tfus | 363.2 | K | N/A | Doering, Farber, et al., 1952 | Uncertainty assigned by TRC = 0.7 K |

Gas phase ion energetics data

Data compiled by: Sharon G. Lias, Rhoda D. Levin, and Sherif A. Kafafi
Ionization energy determinations
IE (eV) | Method | Reference |
---|---|---|
8.30 | PE | Heilbronner and Martin, 1972 |

References

Kozina, Bychikhina, et al., 1975
Kozina, M.P.; Bychikhina, L.V.; Gal'chenko, G.L.; Ordubadi, M.; Belikova, N.A.; Plate, A.F.,
Enthalpies of combustion of 7,7-dimethyl-and 2-ethyl-bicyclo[2,2,1]heptanes,
Russ. J. Phys. Chem. (Engl. Transl.), 1975, 49, 141. [all data]
Doering, Farber, et al., 1952
Doering, W. vonE.; Farber, M.; Sprecher, M.; Wiberg, K.B.,
On the Decarbonmonoxylation Reaction,
J. Am. Chem. Soc., 1952, 74, 3000. [all data]
Heilbronner and Martin, 1972
Heilbronner, E.; Martin, H.D.,
The π-orbital sequence in norbornadiene and related hydrocarbons,
Helv. Chim. Acta, 1972, 55, 1490. [all data]