3-Butyn-2-ol
- Formula: C4H6O
- Molecular weight: 70.0898
- IUPAC Standard InChIKey: GKPOMITUDGXOSB-UHFFFAOYSA-N
- CAS Registry Number: 2028-63-9
- Chemical structure:
View 3d structure (requires JavaScript / HTML 5) - Other names: α-Methylpropargyl alcohol; Methylethynylcarbinol; 1-Butyn-3-ol; 1-Methyl-2-propynyl alcohol; 1-Methylpropargyl alcohol; 3-Butyne-2-ol; 3-Hydroxy-1-butyne; HC≡CCH(CH3)OH; 1-Ethynylethanol; but-3-yn-2-ol

Phase change data

Data compiled by: Robert L. Brown and Stephen E. Stein
Quantity | Value | Units | Method | Reference | Comment |
---|---|---|---|---|---|
Tboil | 381. | K | N/A | Farchan Laboratories, 1990 |

Gas phase ion energetics data

Data compiled as indicated in comments:
LBLHLM - Sharon G. Lias, John E. Bartmess, Joel F. Liebman, John L. Holmes, Rhoda D. Levin, and W. Gary Mallard
LLK - Sharon G. Lias, Rhoda D. Levin, and Sherif A. Kafafi
Ionization energy determinations
IE (eV) | Method | Reference | Comment |
---|---|---|---|
≤10.15 | EI | Holmes and Lossing, 1986 | LBLHLM |
10.41 | PE | Andreocci, Bitchev, et al., 1979 | Vertical value; LLK |

Normal alkane RI, non-polar column, custom temperature program

Column type | Active phase | I | Reference | Comment |
---|---|---|---|---|
Capillary | Methyl Silicone | 608. | Zenkevich, 1996 | Program: not specified |

References

Farchan Laboratories, 1990
Farchan Laboratories,
Research Chemicals Catalog, Farchan Laboratories, Gainesville, FL, 1990, 91. [all data]
Holmes and Lossing, 1986
Holmes, J.L.; Lossing, F.P.,
Title unavailable,
Personal communication to S.G. Lias, 1986. [all data]
Andreocci, Bitchev, et al., 1979
Andreocci, M.V.; Bitchev, P.; Carusi, P.; Furlani, A.,
Valence shell photoionization spectra of some substituted hydroxy-acetylenes. A tentative correlation with their cyclotrimerization reactions,
J. Electron Spectrosc. Relat. Phenom., 1979, 16, 25. [all data]
Zenkevich, 1996
Zenkevich, I.G.,
Informational Maitenance of Gas Chromatographic Identification of Organic Compounds in Ecoanalytical Investigations,
Z. Anal. Chem., 1996, 51, 11, 1140-1148. [all data]