(E)-1,3-Hexadiene
- Formula: C6H10
- Molecular weight: 82.1436
- IUPAC Standard InChIKey: AHAREKHAZNPPMI-AATRIKPKSA-N
- CAS Registry Number: 20237-34-7
- Chemical structure:
View 3d structure (requires JavaScript / HTML 5) - Species with the same structure:
- Stereoisomers:
- Other names: 1,3-Hexadiene, (E)-; 1,trans-3-hexadiene

Gas phase thermochemistry data

Data compiled by: Hussein Y. Afeefy, Joel F. Liebman, and Stephen E. Stein
Quantity | Value | Units | Method | Reference | Comment |
---|---|---|---|---|---|
ΔfH°gas | 54. ± 2. | kJ/mol | Chyd | Fang and Rogers, 1992 |

Phase change data

Data compiled by: Thermodynamics Research Center, NIST Boulder Laboratories, Chris Muzny director
Quantity | Value | Units | Method | Reference | Comment |
---|---|---|---|---|---|
Tboil | 346.4 | K | N/A | Anonymous, 1963 | Uncertainty assigned by TRC = 0.6 K |
Quantity | Value | Units | Method | Reference | Comment |
Tfus | 170.8 | K | N/A | Anonymous, 1963 | Uncertainty assigned by TRC = 0.6 K |

Reaction thermochemistry data

Data compiled by: Hussein Y. Afeefy, Joel F. Liebman, and Stephen E. Stein
Individual Reactions
By formula: 2H2 + C6H10 = C6H14
Quantity | Value | Units | Method | Reference | Comment |
---|---|---|---|---|---|
ΔrH° | -221. ± 1. | kJ/mol | Chyd | Fang and Rogers, 1992 | liquid phase; solvent: Cyclohexane |
By formula: C6H10 = C6H10
Quantity | Value | Units | Method | Reference | Comment |
---|---|---|---|---|---|
ΔrH° | -12.80 | kJ/mol | Eqk | Petrova-Kuminskaya, Roganov, et al., 1984 | gas phase; At 458 K, see Petrova-Kuminskaya, Baranov, et al., 1983 |
By formula: C6H10 = C6H10
Quantity | Value | Units | Method | Reference | Comment |
---|---|---|---|---|---|
ΔrH° | -4.52 | kJ/mol | Eqk | Petrova-Kuminskaya, Roganov, et al., 1984 | gas phase; At 458 K, see Petrova-Kuminskaya, Baranov, et al., 1983 |
By formula: C6H10 = C6H10
Quantity | Value | Units | Method | Reference | Comment |
---|---|---|---|---|---|
ΔrH° | 1.09 | kJ/mol | Eqk | Petrova-Kuminskaya, Roganov, et al., 1984 | gas phase; At 458 K, see Petrova-Kuminskaya, Roganov, et al., 1984, 2 |
By formula: C6H10 = C6H10
Quantity | Value | Units | Method | Reference | Comment |
---|---|---|---|---|---|
ΔrH° | 13.6 | kJ/mol | Eqk | Buechele, Weitz, et al., 1984 | gas phase |

Gas phase ion energetics data

Data compiled as indicated in comments:
LLK - Sharon G. Lias, Rhoda D. Levin, and Sherif A. Kafafi
Ionization energy determinations
IE (eV) | Method | Reference | Comment |
---|---|---|---|
8.54 ± 0.05 | EI | Wolkoff, Holmes, et al., 1980 | LLK |
8.53 ± 0.02 | PE | Bieri, Burger, et al., 1977 | LLK |
8.51 | PE | Masclet, Mouvier, et al., 1981 | Vertical value; LLK |
Appearance energy determinations
Ion | AE (eV) | Other Products | Method | Reference | Comment |
---|---|---|---|---|---|
C5H7+ | 9.74 ± 0.05 | CH3 | EI | Wolkoff, Holmes, et al., 1980 | LLK |

Kovats' RI, non-polar column, isothermal

Column type | Active phase | Temperature (C) | I | Reference | Comment |
---|---|---|---|---|---|
Packed | Squalane | 70. | 612. | Safina, Poznyak, et al., 1989 | He, Risorb (0.2-0.3 mm); Column length: 2. m |
Capillary | Squalane | 50. | 612.5 | Bajus, Veselý, et al., 1979 | Column length: 100. m; Column diameter: 0.25 mm |
Packed | Squalane | 27. | 612. | Hively and Hinton, 1968 | He, Chromosorb P; Column length: 15. m; Column diameter: 0.25 mm |
Packed | Squalane | 49. | 614. | Hively and Hinton, 1968 | He, Chromosorb P; Column length: 15. m; Column diameter: 0.25 mm |
Packed | Squalane | 67. | 614. | Hively and Hinton, 1968 | He, Chromosorb P; Column length: 15. m; Column diameter: 0.25 mm |
Packed | Squalane | 86. | 615. | Hively and Hinton, 1968 | He, Chromosorb P; Column length: 15. m; Column diameter: 0.25 mm |

Normal alkane RI, non-polar column, isothermal

Column type | Active phase | Temperature (C) | I | Reference | Comment |
---|---|---|---|---|---|
Capillary | Squalane | 70. | 611. | Schomburg, 1966 |

Normal alkane RI, non-polar column, temperature ramp

Column type | Active phase | I | Reference | Comment |
---|---|---|---|---|
Capillary | OV-101 | 617. | Chupalov and Zenkevich, 1996 | N2, 3. K/min; Column length: 52. m; Column diameter: 0.26 mm; Tstart: 50. C; Tend: 220. C |

References

Fang and Rogers, 1992
Fang, W.; Rogers, D.W.,
Enthalpy of hydrogenation of the hexadienes and cis- and trans-1,3,5-hexatriene,
J. Org. Chem., 1992, 57, 2294-2297. [all data]
Anonymous, 1963
Anonymous, R.,
, E. I. Du Pont, 1963. [all data]
Petrova-Kuminskaya, Roganov, et al., 1984
Petrova-Kuminskaya, S.V.; Roganov, G.N.; Kabo, G.Ya.,
Enthalpies of formation and isomerization of alkadienes,
Probl. Kalorim. Khim. Termodin., Dokl. Vses. Konf., 10th, 1984, 1, 234-236. [all data]
Petrova-Kuminskaya, Baranov, et al., 1983
Petrova-Kuminskaya, S.V.; Baranov, O.M.; Roganov, G.N.; Kabo, G.Ya.,
Equilibrium and thermodynamics of the isomerization of hexadienes,
Neftekhimiya, 1983, 23, 489-494. [all data]
Petrova-Kuminskaya, Roganov, et al., 1984, 2
Petrova-Kuminskaya, S.V.; Roganov, G.N.; Kabo, G.Ya.,
Equilibrium of isomerization of 2-methylpentadienes,
Neftekhimiya, 1984, 24, 485-490. [all data]
Buechele, Weitz, et al., 1984
Buechele, J.L.; Weitz, E.; Lewis, F.D.,
Laser-induced infrared multiphoton isomerization reactions of 2,4- and 1,3-hexadienes,
J. Phys. Chem., 1984, 88, 868-876. [all data]
Wolkoff, Holmes, et al., 1980
Wolkoff, P.; Holmes, J.L.; Lossing, F.P.,
On the formation of cyclopentenium cations from all C6H10+ molecular ion structures,
Can. J. Chem., 1980, 58, 251. [all data]
Bieri, Burger, et al., 1977
Bieri, G.; Burger, F.; Heilbronner, E.; Maier, J.P.,
Valence ionization enrgies of hydrocarbons,
Helv. Chim. Acta, 1977, 60, 2213. [all data]
Masclet, Mouvier, et al., 1981
Masclet, P.; Mouvier, G.; Bocquet, J.F.,
Effets electroniques et effets steriques dus a la substitution alcoyle dans les dienes conjugues,
J. Chim. Phys., 1981, 78, 99. [all data]
Safina, Poznyak, et al., 1989
Safina, L.R.; Poznyak, T.I.; Lisitsyn, D.M.; Kiseleva, E.V.; Kovalev, G.I.,
Selective gas-chromatographic determination of trace unsaturated and aromatic-hydrocarbons in complex-mixtures,
J. Appl. Chem. USSR (Engl. Transl.), 1989, 44, 5, 749-754. [all data]
Bajus, Veselý, et al., 1979
Bajus, M.; Veselý, V.; Leclercq, P.A.; Rijks, J.A.,
Steam cracking of hydrocarbons. 2. Pyrolysis of methylcyclohexane,
Ind. Eng. Chem. Prod. Res. Dev., 1979, 18, 2, 135-142, https://doi.org/10.1021/i360070a012
. [all data]
Hively and Hinton, 1968
Hively, R.A.; Hinton, R.E.,
Variation of the retention index with temperature on squalane substrates,
J. Gas Chromatogr., 1968, 6, 4, 203-217, https://doi.org/10.1093/chromsci/6.4.203
. [all data]
Schomburg, 1966
Schomburg, G.,
Gaschromatographische Retentionsdaten und Struktur Chemischer Verbindungen. II. Methylverzweigungen und Doppelbindungen in Offenkettigen Kohlenwasserstoffen,
J. Chromatogr., 1966, 23, 1-17, https://doi.org/10.1016/S0021-9673(01)98652-2
. [all data]
Chupalov and Zenkevich, 1996
Chupalov, A.A.; Zenkevich, I.G.,
Chromatographic Characterization of Structural Transformations of Organic Compounds in Diels-Alder Reaction. Aliphatic Dienes and Dienophyls,
Zh. Org. Khim., 1996, 32, 6, 675-684. [all data]