Bicyclo[2.2.1]hept-5-ene-2,3-diol-, (exo,exo)-
- Formula: C7H10O2
- Molecular weight: 126.1531
- IUPAC Standard InChIKey: TZLWRLOYRRZECT-UHFFFAOYSA-N
- CAS Registry Number: 20224-38-8
- Chemical structure:
View 3d structure (requires JavaScript / HTML 5) - Other names: exo-cis-Norborn-5-ene-2,3-diol

Gas phase ion energetics data

Data compiled by: Sharon G. Lias, John E. Bartmess, Joel F. Liebman, John L. Holmes, Rhoda D. Levin, and W. Gary Mallard
Appearance energy determinations
Ion | AE (eV) | Other Products | Method | Reference | Comment |
---|---|---|---|---|---|
C2H4O2+ | 9.38 ± 0.04 | C5H6 | EI | Turecek and Havlas, 1986 |

References

Turecek and Havlas, 1986
Turecek, F.; Havlas, Z.,
Energy barriers to the diels-alder cycloadditions and cycloreversions of cation-radicals in the gas phase,
J. Chem. Soc. Perkin Trans. 2, 1986, 1011. [all data]