Molybdenum difluoride
- Formula: F2Mo
- Molecular weight: 133.96
- CAS Registry Number: 20205-60-1

Gas phase thermochemistry data

Quantity | Value | Units | Method | Reference | Comment |
---|---|---|---|---|---|
ΔfH°gas | -162.76 | kJ/mol | Review | Chase, 1998 | Data last reviewed in December, 1978 |
Quantity | Value | Units | Method | Reference | Comment |
S°gas,1 bar | 271.93 | J/mol*K | Review | Chase, 1998 | Data last reviewed in December, 1978 |
Gas Phase Heat Capacity (Shomate Equation)
Cp° = A + B*t + C*t2 + D*t3 +
E/t2
H° − H°298.15= A*t + B*t2/2 +
C*t3/3 + D*t4/4 − E/t + F − H
S° = A*ln(t) + B*t + C*t2/2 + D*t3/3 −
E/(2*t2) + G
Cp = heat capacity (J/mol*K)
H° = standard enthalpy (kJ/mol)
S° = standard entropy (J/mol*K)
t = temperature (K) / 1000.
View plot Requires a JavaScript / HTML 5 canvas capable browser.
Temperature (K) | 298. to 6000. |
---|---|
A | 62.18303 |
B | 0.110477 |
C | -0.024782 |
D | 0.001866 |
E | -0.443755 |
F | -182.7918 |
G | 344.6545 |
H | -162.7580 |
Reference | Chase, 1998 |
Comment | Data last reviewed in December, 1978 |

Gas phase ion energetics data

Data compiled as indicated in comments:
LLK - Sharon G. Lias, Rhoda D. Levin, and Sherif A. Kafafi
Ionization energy determinations
IE (eV) | Method | Reference | Comment |
---|---|---|---|
9.00 ± 0.15 | EI | Hildenbrand, 1976 | LLK |

References

Chase, 1998
Chase, M.W., Jr.,
NIST-JANAF Themochemical Tables, Fourth Edition,
J. Phys. Chem. Ref. Data, Monograph 9, 1998, 1-1951. [all data]
Hildenbrand, 1976
Hildenbrand, D.L.,
Thermochemical studies of the gaseous lower valent fluorides of molybdenum,
J. Chem. Phys., 1976, 65, 614. [all data]