Molybdenum trifluoride
- Formula: F3Mo
- Molecular weight: 152.96
- CAS Registry Number: 20193-58-2

Gas phase ion energetics data

Data compiled as indicated in comments:
LLK - Sharon G. Lias, Rhoda D. Levin, and Sherif A. Kafafi
Ionization energy determinations
IE (eV) | Method | Reference | Comment |
---|---|---|---|
10.2 ± 0.5 | EI | Alikhanyan, Steblevskii, et al., 1978 | LLK |
9.88 ± 0.10 | EI | Hildenbrand, 1976 | LLK |
Appearance energy determinations
Ion | AE (eV) | Other Products | Method | Reference | Comment |
---|---|---|---|---|---|
F2Mo+ | 14.3 ± 1.0 | F | EI | Alikhanyan, Steblevskii, et al., 1978 | LLK |

References

Alikhanyan, Steblevskii, et al., 1978
Alikhanyan, A.S.; Steblevskii, A.V.; Malkerova, I.P.; Pervov, V.S.; Butskii, V.D.; Gorgoraki, V.I.,
Mass spectrometric study of the sublimation of molybdenum trifluoride,
Russ. J. Inorg. Chem., 1978, 23, 814. [all data]
Hildenbrand, 1976
Hildenbrand, D.L.,
Thermochemical studies of the gaseous lower valent fluorides of molybdenum,
J. Chem. Phys., 1976, 65, 614. [all data]