(E)-1,2,4-Hexatriene
- Formula: C6H8
- Molecular weight: 80.1277
- IUPAC Standard InChIKey: NETPEWDFCPYQCU-GQCTYLIASA-N
- CAS Registry Number: 20130-95-4
- Chemical structure:
View 3d structure (requires JavaScript / HTML 5) - Permanent link for this species. Use this link for bookmarking this species for future reference.

Gas phase ion energetics data

Data compiled as indicated in comments:
LLK - Sharon G. Lias, Rhoda D. Levin, and Sherif A. Kafafi
Ionization energy determinations
IE (eV) | Method | Reference | Comment |
---|---|---|---|
8.32 | PE | Delwiche, Praet, et al., 1979 | Vertical value; LLK |

References

Delwiche, Praet, et al., 1979
Delwiche, J.; Praet, M.-Th.; Caprace, G.; Franskin-Hubin, M.-J.; Natalis, P.; Collin, J.E.,
The HeI photoelectron spectra of methyl-substituted 1,2,4-pentatrienes (vinylallene),
J. Electron Spectrosc. Relat. Phenom., 1979, 16, 35. [all data]