(E)-3,3-Dimethyl-1-trimethylsilyl-1-butene
- Formula: C9H20Si
- Molecular weight: 156.3406
- IUPAC Standard InChIKey: BRIDLWZGGDIJRM-BQYQJAHWSA-N
- CAS Registry Number: 20107-37-3
- Chemical structure:
View 3d structure (requires JavaScript / HTML 5) - Permanent link for this species. Use this link for bookmarking this species for future reference.

Gas phase ion energetics data

Data compiled by: Henry M. Rosenstock, Keith Draxl, Bruce W. Steiner, and John T. Herron
Ionization energy determinations
IE (eV) | Method | Reference |
---|---|---|
9.08 ± 0.04 | EI | Bock and Seidl, 1968 |

References

Bock and Seidl, 1968
Bock, H.; Seidl, H.,
d-Orbitaleffekte in siliziumsubstituierten π-Elektronensystemen. VI. Spektroskopische Untersuchungen an Alkyl- und Silylathylenen,
J. Organometal. Chem., 1968, 13, 87. [all data]