Benzonitrile, 4-(bromoacetyl)-
- Formula: C9H6BrNO
- Molecular weight: 224.054
- IUPAC Standard InChIKey: LJANCPRIUMHGJE-UHFFFAOYSA-N
- CAS Registry Number: 20099-89-2
- Chemical structure:
View 3d structure (requires JavaScript / HTML 5) - Other names: 4-Cyanophenacyl bromide; p-Bromoacetylbenzonitrile; Benzonitrile, 4-(2-bromoacetyl)-; 4-(2-Bromoacety)-BenZonitrile

Gas phase ion energetics data

Data compiled by: Sharon G. Lias, John E. Bartmess, Joel F. Liebman, John L. Holmes, Rhoda D. Levin, and W. Gary Mallard
Ionization energy determinations
IE (eV) | Method | Reference | Comment |
---|---|---|---|
9.9 | PE | Distefano, Granozzi, et al., 1987 | Vertical value |

References

Distefano, Granozzi, et al., 1987
Distefano, G.; Granozzi, G.; Olivato, P.R.; Guerrero, S.A.,
Hyperconjugative interactions in halogen-substituted carbonyls: Ultraviolet photoelectron spectroscopy of w-halogenoacetophenones,
J. Chem. Soc. Perkin Trans. 2, 1987, 1459. [all data]