Benzene, 1,1'-(1,2-cyclobutanediyl)bis-, trans-
- Formula: C16H16
- Molecular weight: 208.2982
- IUPAC Standard InChIKey: AERGGMDNGDDGPI-HZPDHXFCSA-N
- CAS Registry Number: 20071-09-4
- Chemical structure:
View 3d structure (requires JavaScript / HTML 5) - Stereoisomers:
- Other names: trans-1,2-Diphenylcyclobutane; (2-Phenylcyclobutyl)benzene,(E)-; Cyclobutane, 1,2-diphenyl, trans

Gas phase ion energetics data

Data compiled as indicated in comments:
LBLHLM - Sharon G. Lias, John E. Bartmess, Joel F. Liebman, John L. Holmes, Rhoda D. Levin, and W. Gary Mallard
Ionization energy determinations
IE (eV) | Method | Reference | Comment |
---|---|---|---|
8.2 ± 0.1 | EI | Groenwold, Chess, et al., 1984 | LBLHLM |
Appearance energy determinations
Ion | AE (eV) | Other Products | Method | Reference | Comment |
---|---|---|---|---|---|
C8H8+ | 9.0 ± 0.1 | C8H8 | EI | Groenwold, Chess, et al., 1984 | LBLHLM |

Normal alkane RI, non-polar column, temperature ramp

Column type | Active phase | I | Reference | Comment |
---|---|---|---|---|
Packed | SE-30 | 1720. | Khudobina and Zenkevich, 1984 | Helium, Chromosorb W (80-100 mesh), 50. C @ 0. min, 5. K/min, 250. C @ 0. min; Column length: 1.8 m |

References

Groenwold, Chess, et al., 1984
Groenwold, G.S.; Chess, E.K.; Gross, M.L.,
Structure of the intermediate formed in the reaction of the styrene radical cation and neutral styrene,
J. Am. Chem. Soc., 1984, 106, 539. [all data]
Khudobina and Zenkevich, 1984
Khudobina, G.V.; Zenkevich, I.G.,
Chromato Mass Spectrometric Identification of Dimers in Recycled Styrene, VINITI, # 8039-84, 1984, 14. [all data]