1,3-Pentadiene, (E)-
- Formula: C5H8
- Molecular weight: 68.1170
- IUPAC Standard InChIKey: PMJHHCWVYXUKFD-SNAWJCMRSA-N
- CAS Registry Number: 2004-70-8
- Chemical structure:
View 3d structure (requires JavaScript / HTML 5) - Stereoisomers:
- Other names: (E)-1,3-Pentadiene; trans-Piperylene; trans-1-Methylbutadiene; trans-1,3-Pentadiene; (E)-CH2=CHCH=CHCH3; 1,trans-3-Pentadiene; Pentadiene-1,3,trans; trans-penta-1,3-diene

Gas phase thermochemistry data

Data compiled as indicated in comments:
ALS - Hussein Y. Afeefy, Joel F. Liebman, and Stephen E. Stein
GT - Glushko Thermocenter, Russian Academy of Sciences, Moscow
Quantity | Value | Units | Method | Reference | Comment |
---|---|---|---|---|---|
ΔfH°gas | 75.77 ± 0.67 | kJ/mol | Cm | Fraser and Prosen, 1955 | ALS |
Quantity | Value | Units | Method | Reference | Comment |
ΔcH°gas | -3186.7 ± 0.63 | kJ/mol | Cm | Fraser and Prosen, 1955 | Corresponding ΔfHºgas = 75.81 kJ/mol (simple calculation by NIST; no Washburn corrections); ALS |
Quantity | Value | Units | Method | Reference | Comment |
S°gas | 315.60 | J/mol*K | N/A | Messerly J.F., 1970 | GT |
Constant pressure heat capacity of gas
Cp,gas (J/mol*K) | Temperature (K) | Reference | Comment |
---|---|---|---|
36.96 | 50. | Thermodynamics Research Center, 1997 | Comparison with other statistical thermodynamics calculations [ Petrova-Kuminskaya S.V., 1986, Compton D.A.C., 1977] show that S and Cp values from TRC Tables are possibly underestimated at high temperatures.; GT |
50.54 | 100. | ||
62.88 | 150. | ||
74.55 | 200. | ||
92.60 | 273.15 | ||
99.06 | 298.15 | ||
99.54 | 300. | ||
125.09 | 400. | ||
147.98 | 500. | ||
167.43 | 600. | ||
183.91 | 700. | ||
198.0 | 800. | ||
210.1 | 900. | ||
220.6 | 1000. | ||
229.6 | 1100. | ||
237.4 | 1200. | ||
244.2 | 1300. | ||
250.1 | 1400. | ||
255.2 | 1500. |

Condensed phase thermochemistry data

Data compiled by: Eugene S. Domalski and Elizabeth D. Hearing
Quantity | Value | Units | Method | Reference | Comment |
---|---|---|---|---|---|
S°liquid | 227.11 | J/mol*K | N/A | Messerly, Todd, et al., 1970 |
Constant pressure heat capacity of liquid
Cp,liquid (J/mol*K) | Temperature (K) | Reference | Comment |
---|---|---|---|
149.33 | 298.15 | Messerly, Todd, et al., 1970 | T = 12 to 320 K. |

Phase change data

Data compiled as indicated in comments:
BS - Robert L. Brown and Stephen E. Stein
TRC - Thermodynamics Research Center, NIST Boulder Laboratories, Chris Muzny director
AC - William E. Acree, Jr., James S. Chickos
DH - Eugene S. Domalski and Elizabeth D. Hearing
Quantity | Value | Units | Method | Reference | Comment |
---|---|---|---|---|---|
Tboil | 315.1 ± 0.4 | K | AVG | N/A | Average of 7 values; Individual data points |
Quantity | Value | Units | Method | Reference | Comment |
Tfus | 185.2 ± 0.9 | K | AVG | N/A | Average of 7 values; Individual data points |
Quantity | Value | Units | Method | Reference | Comment |
Ttriple | 185.71 | K | N/A | Messerly, Todd, et al., 1970, 2 | Uncertainty assigned by TRC = 0.05 K; TRC |
Quantity | Value | Units | Method | Reference | Comment |
ΔvapH° | 27.8 | kJ/mol | N/A | Reid, 1972 | AC |
Enthalpy of vaporization
ΔvapH (kJ/mol) | Temperature (K) | Method | Reference | Comment |
---|---|---|---|---|
30.7 | 242. | A | Stephenson and Malanowski, 1987 | Based on data from 228. to 256. K.; AC |
29.5 | 271. | A | Stephenson and Malanowski, 1987 | Based on data from 256. to 324. K.; AC |
31.3 | 230. | IP | Osborn and Douslin, 1969 | Based on data from 213. to 242. K.; AC |
28.3 | 304. | MM | Forziati, Camin, et al., 1950 | Based on data from 292. to 316. K.; AC |
Antoine Equation Parameters
log10(P) = A − (B / (T + C))
P = vapor pressure (bar)
T = temperature (K)
View plot Requires a JavaScript / HTML 5 canvas capable browser.
Temperature (K) | A | B | C | Reference | Comment |
---|---|---|---|---|---|
213.14 to 242.22 | 4.25342 | 1196.308 | -32.775 | Osborn and Douslin, 1969 | Coefficents calculated by NIST from author's data. |
Enthalpy of fusion
ΔfusH (kJ/mol) | Temperature (K) | Reference | Comment |
---|---|---|---|
7.1438 | 185.71 | Messerly, Todd, et al., 1970 | DH |
7.14 | 185.7 | Domalski and Hearing, 1996 | AC |
Entropy of fusion
ΔfusS (J/mol*K) | Temperature (K) | Reference | Comment |
---|---|---|---|
38.468 | 185.71 | Messerly, Todd, et al., 1970 | DH |

Reaction thermochemistry data

Data compiled as indicated in comments:
B - John E. Bartmess
ALS - Hussein Y. Afeefy, Joel F. Liebman, and Stephen E. Stein
Individual Reactions
C5H7- + =
Quantity | Value | Units | Method | Reference | Comment |
---|---|---|---|---|---|
ΔrH° | 1545. ± 5.0 | kJ/mol | D-EA | Zimmerman, Gygax, et al., 1978 | gas phase; Acid: 1,4-pentadiene. (Z)-1,3-pentadiene is 7.0 kcal/mol more stable(weaker acid); B |
Quantity | Value | Units | Method | Reference | Comment |
ΔrG° | 1525. ± 7.9 | kJ/mol | H-TS | Zimmerman, Gygax, et al., 1978 | gas phase; Acid: 1,4-pentadiene. (Z)-1,3-pentadiene is 7.0 kcal/mol more stable(weaker acid); B |
By formula: C5H8 = C5H8
Quantity | Value | Units | Method | Reference | Comment |
---|---|---|---|---|---|
ΔrH° | -4.23 ± 0.75 | kJ/mol | Eqk | Egger and Benson, 1965 | gas phase; Heat of isomerization; ALS |
By formula: Cl- + C5H8 = (Cl- • C5H8)
Quantity | Value | Units | Method | Reference | Comment |
---|---|---|---|---|---|
ΔrG° | 15.5 | kJ/mol | TDEq | French, Ikuta, et al., 1982 | gas phase; B |

Gas phase ion energetics data

Data evaluated as indicated in comments:
HL - Edward P. Hunter and Sharon G. Lias
L - Sharon G. Lias
Data compiled as indicated in comments:
B - John E. Bartmess
LLK - Sharon G. Lias, Rhoda D. Levin, and Sherif A. Kafafi
RDSH - Henry M. Rosenstock, Keith Draxl, Bruce W. Steiner, and John T. Herron
Quantity | Value | Units | Method | Reference | Comment |
---|---|---|---|---|---|
IE (evaluated) | 8.59 ± 0.02 | eV | N/A | N/A | L |
Quantity | Value | Units | Method | Reference | Comment |
Proton affinity (review) | 834.1 | kJ/mol | N/A | Hunter and Lias, 1998 | HL |
Quantity | Value | Units | Method | Reference | Comment |
Gas basicity | 804.4 | kJ/mol | N/A | Hunter and Lias, 1998 | HL |
Ionization energy determinations
IE (eV) | Method | Reference | Comment |
---|---|---|---|
8.59 ± 0.02 | PE | Masclet, Mouvier, et al., 1981 | LLK |
8.61 ± 0.02 | PE | Bieri, Burger, et al., 1977 | LLK |
8.60 | EI | Lossing and Traeger, 1975 | LLK |
8.61 | PE | Beez, Bieri, et al., 1973 | LLK |
8.56 | PE | Dewar and Worley, 1968 | RDSH |
Appearance energy determinations
Ion | AE (eV) | Other Products | Method | Reference | Comment |
---|---|---|---|---|---|
C3H2+ | 20.9 ± 0.1 | ? | EI | Franklin and Mogenis, 1967 | RDSH |
C3H3+ | 15.16 ± 0.02 | ? | EI | Franklin and Mogenis, 1967 | RDSH |
C3H4+ | 12.63 ± 0.02 | C2H4 | EI | Franklin and Mogenis, 1967 | RDSH |
C3H5+ | 14.20 ± 0.02 | ? | EI | Franklin and Mogenis, 1967 | RDSH |
C3H6+ | 12.73 ± 0.03 | C2H2 | EI | Franklin and Mogenis, 1967 | RDSH |
C4H3+ | 16.36 ± 0.08 | CH3+H2 | EI | Franklin and Mogenis, 1967 | RDSH |
C4H4+ | 21.12 ± 0.08 | ? | EI | Franklin and Mogenis, 1967 | RDSH |
C4H5+ | 12.57 ± 0.05 | CH3 | EI | Franklin and Mogenis, 1967 | RDSH |
C4H6+ | 13.1 ± 0.1 | ? | EI | Franklin and Mogenis, 1967 | RDSH |
C5H5+ | 13.90 ± 0.05 | H2+H | EI | Franklin and Mogenis, 1967 | RDSH |
C5H6+ | 12.34 ± 0.06 | H2 | EI | Franklin and Mogenis, 1967 | RDSH |
C5H7+ | 8.60 | H | EI | Lossing and Traeger, 1975, 2 | LLK |
C5H7+ | 10.52 | H | EI | Lossing and Traeger, 1975 | LLK |
C5H7+ | 10.93 ± 0.02 | H | EI | Franklin and Mogenis, 1967 | RDSH |
De-protonation reactions
C5H7- + =
Quantity | Value | Units | Method | Reference | Comment |
---|---|---|---|---|---|
ΔrH° | 1545. ± 5.0 | kJ/mol | D-EA | Zimmerman, Gygax, et al., 1978 | gas phase; Acid: 1,4-pentadiene. (Z)-1,3-pentadiene is 7.0 kcal/mol more stable(weaker acid); B |
Quantity | Value | Units | Method | Reference | Comment |
ΔrG° | 1525. ± 7.9 | kJ/mol | H-TS | Zimmerman, Gygax, et al., 1978 | gas phase; Acid: 1,4-pentadiene. (Z)-1,3-pentadiene is 7.0 kcal/mol more stable(weaker acid); B |

Ion clustering data

Data compiled by: John E. Bartmess
Clustering reactions
By formula: Cl- + C5H8 = (Cl- • C5H8)
Quantity | Value | Units | Method | Reference | Comment |
---|---|---|---|---|---|
ΔrG° | 15.5 | kJ/mol | TDEq | French, Ikuta, et al., 1982 | gas phase |

Kovats' RI, non-polar column, isothermal

Column type | Active phase | Temperature (C) | I | Reference | Comment |
---|---|---|---|---|---|
Capillary | OV-1 | 27. | 515. | Heberger, 1990 | 25. m/0.25 mm/0.50 μm, He |
Capillary | OV-1 | 30. | 526. | Heberger, 1990 | 25. m/0.25 mm/0.50 μm, He |
Capillary | OV-1 | 40. | 506. | Heberger, 1990 | 25. m/0.25 mm/0.50 μm, He |
Capillary | OV-1 | 75. | 522. | Heberger, 1990 | 25. m/0.25 mm/0.50 μm, He |
Packed | Squalane | 70. | 516. | Safina, Poznyak, et al., 1989 | He, Risorb (0.2-0.3 mm); Column length: 2. m |
Capillary | Squalane | 50. | 515.8 | Papazova, Milina, et al., 1988 | Column length: 50. m; Column diameter: 0.25 mm |
Capillary | Squalane | 50. | 515.700 | Bajus, Veselý, et al., 1979 | Column length: 100. m; Column diameter: 0.25 mm |
Capillary | Squalane | 70. | 516.5 | Bajus, Veselý, et al., 1979 | Column length: 100. m; Column diameter: 0.25 mm |
Capillary | Squalane | 50. | 515.700 | Bajus, Veselý, et al., 1979, 2 | Column length: 100. m; Column diameter: 0.25 mm |
Capillary | Squalane | 70. | 516.2 | Bajus, Veselý, et al., 1979, 2 | Column length: 100. m; Column diameter: 0.25 mm |
Capillary | Squalane | 50. | 526. | Rijks and Cramers, 1974 | N2; Column length: 100. m; Column diameter: 0.25 mm |
Capillary | Squalane | 70. | 516. | Rijks and Cramers, 1974 | N2; Column length: 100. m; Column diameter: 0.25 mm |
Capillary | Squalane | 27. | 513.75 | Schomburg and Dielmann, 1973 | Column length: 100. m; Column diameter: 0.25 mm |
Packed | Squalane | 27. | 515. | Hively and Hinton, 1968 | He, Chromosorb P; Column length: 15. m; Column diameter: 0.25 mm |
Packed | Squalane | 49. | 516. | Hively and Hinton, 1968 | He, Chromosorb P; Column length: 15. m; Column diameter: 0.25 mm |
Packed | Squalane | 67. | 518. | Hively and Hinton, 1968 | He, Chromosorb P; Column length: 15. m; Column diameter: 0.25 mm |
Packed | Squalane | 86. | 519. | Hively and Hinton, 1968 | He, Chromosorb P; Column length: 15. m; Column diameter: 0.25 mm |
Packed | Squalane | 26. | 518. | Zulaïca and Guiochon, 1966 | Column length: 10. m |

Kovats' RI, non-polar column, custom temperature program

Column type | Active phase | I | Reference | Comment |
---|---|---|---|---|
Capillary | Petrocol DH-100 | 528. | Haagen-Smit Laboratory, 1997 | He; Column length: 100. m; Column diameter: 0.2 mm; Program: 5C(10min) => 5C/min => 50C(48min) => 1.5C/min => 195C(91min) |
Capillary | DB-1 | 526. | Hoekman, 1993 | 60. m/0.32 mm/1.0 μm, He; Program: -40 C for 12 min; -40 - 125 C at 3 deg.min; 125-185 C at 6 deg/min; 185 - 220 C at 20 deg/min; hold 220 C for 2 min |

Van Den Dool and Kratz RI, non-polar column, temperature ramp

Column type | Active phase | I | Reference | Comment |
---|---|---|---|---|
Capillary | DB-1 | 524. | Kaiser and Siegl, 1994 | 60. m/0.32 mm/1. μm, -50. C @ 4. min, 6. K/min; Tend: 180. C |

Normal alkane RI, non-polar column, isothermal

Column type | Active phase | Temperature (C) | I | Reference | Comment |
---|---|---|---|---|---|
Capillary | Squalane | 70. | 515. | Schomburg, 1966 |

Normal alkane RI, non-polar column, temperature ramp

Column type | Active phase | I | Reference | Comment |
---|---|---|---|---|
Capillary | Polydimethyl siloxane: CP-Sil 5 CB | 521. | Bramston-Cook, 2013 | 60. m/0.25 mm/1.0 μm, Helium, 45. C @ 1.45 min, 3.6 K/min, 210. C @ 2.72 min |
Capillary | Petrocol DH | 523. | Supelco, 2012 | 100. m/0.25 mm/0.50 μm, Helium, 20. C @ 15. min, 15. K/min, 220. C @ 30. min |
Capillary | HP-1 | 519. | Berlioz, Cordella, et al., 2006 | 50. m/0.2 mm/0.33 μm, N2, 2. K/min, 250. C @ 20. min; Tstart: 60. C |
Capillary | OV-101 | 521. | Chupalov and Zenkevich, 1996 | N2, 3. K/min; Column length: 52. m; Column diameter: 0.26 mm; Tstart: 50. C; Tend: 220. C |

Normal alkane RI, non-polar column, custom temperature program

Column type | Active phase | I | Reference | Comment |
---|---|---|---|---|
Capillary | PONA | 528. | Perkin Elmer Instruments, 2002 | Column length: 100. m; Phase thickness: 0.50 μm; Program: not specified |

References

Fraser and Prosen, 1955
Fraser, F.M.; Prosen, E.J.,
Heats of combustion and isomerization of six pentadienes and spiropentane,
J. Res. NBS, 1955, 54, 143-148. [all data]
Messerly J.F., 1970
Messerly J.F.,
Chemical thermodynamic properties of the pentadienes. Third law studies,
J. Chem. Eng. Data, 1970, 15, 227-232. [all data]
Thermodynamics Research Center, 1997
Thermodynamics Research Center,
Selected Values of Properties of Chemical Compounds., Thermodynamics Research Center, Texas A&M University, College Station, Texas, 1997. [all data]
Petrova-Kuminskaya S.V., 1986
Petrova-Kuminskaya S.V.,
Thermodynamic properties of 1,4-pentadiene and trans-1,3-pentadiene calculated by statistical thermodynamics method,
Vestn. Beloruss. Univ., Ser. 2, 1986, 6-8. [all data]
Compton D.A.C., 1977
Compton D.A.C.,
Conformations of conjugated hydrocarbons. Part 2. A spectroscopic and thermodynamic study of cis- and trans-penta-1,3-diene,
J. Chem. Soc. Perkin Trans. 2, 1977, 1311-1315. [all data]
Messerly, Todd, et al., 1970
Messerly, J.F.; Todd, S.S.; Guthrie, G.B.,
Chemical thermodynamic properties of the pentadienes,
J. Chem. Eng. Data, 1970, 15, 227-232. [all data]
Messerly, Todd, et al., 1970, 2
Messerly, J.F.; Todd, S.S.; Guthrie, G.B.,
Chemical thermodynamic properties of the pentadienes. Third law studies.,
J. Chem. Eng. Data, 1970, 15, 227-32. [all data]
Reid, 1972
Reid, Robert C.,
Handbook on vapor pressure and heats of vaporization of hydrocarbons and related compounds, R. C. Wilhort and B. J. Zwolinski, Texas A Research Foundation. College Station, Texas(1971). 329 pages.$10.00,
AIChE J., 1972, 18, 6, 1278-1278, https://doi.org/10.1002/aic.690180637
. [all data]
Stephenson and Malanowski, 1987
Stephenson, Richard M.; Malanowski, Stanislaw,
Handbook of the Thermodynamics of Organic Compounds, 1987, https://doi.org/10.1007/978-94-009-3173-2
. [all data]
Osborn and Douslin, 1969
Osborn, Ann G.; Douslin, Donald R.,
Vapor pressure relations for the seven pentadienes,
J. Chem. Eng. Data, 1969, 14, 2, 208-209, https://doi.org/10.1021/je60041a010
. [all data]
Forziati, Camin, et al., 1950
Forziati, A.F.; Camin, D.L.; Rossini, F.D.,
Density, refractive index, boiling point, and vapor pressure of eight monoolefin (1-alkene), six pentadiene, and two cyclomonoolefin hydrocarbons,
J. RES. NATL. BUR. STAN., 1950, 45, 5, 406, https://doi.org/10.6028/jres.045.044
. [all data]
Domalski and Hearing, 1996
Domalski, Eugene S.; Hearing, Elizabeth D.,
Heat Capacities and Entropies of Organic Compounds in the Condensed Phase. Volume III,
J. Phys. Chem. Ref. Data, 1996, 25, 1, 1, https://doi.org/10.1063/1.555985
. [all data]
Zimmerman, Gygax, et al., 1978
Zimmerman, A.H.; Gygax, R.; Brauman, J.I.,
Electron photodetachment spectroscopy of polyene anions. Electron affinities of pentadienyl and heptatrienyl radicals,
J. Am. Chem. Soc., 1978, 100, 5595. [all data]
Egger and Benson, 1965
Egger, K.W.; Benson, S.W.,
Nitric oxide and iodine catalyzed isomerization of olefins. IV. Thermodynamic data from equilibrium studies of the geometrical isomerization of 1,3-pentadiene,
J. Am. Chem. Soc., 1965, 87, 3311-3314. [all data]
French, Ikuta, et al., 1982
French, M.A.; Ikuta, S.; Kebarle, P.,
Hydrogen bonding of O-H and C-H hydrogen donors to Cl-. Results from mass spectrometric measurement of the ion-molecule equilibria RH + Cl- = RHCl-,
Can. J. Chem., 1982, 60, 1907. [all data]
Hunter and Lias, 1998
Hunter, E.P.; Lias, S.G.,
Evaluated Gas Phase Basicities and Proton Affinities of Molecules: An Update,
J. Phys. Chem. Ref. Data, 1998, 27, 3, 413-656, https://doi.org/10.1063/1.556018
. [all data]
Masclet, Mouvier, et al., 1981
Masclet, P.; Mouvier, G.; Bocquet, J.F.,
Effets electroniques et effets steriques dus a la substitution alcoyle dans les dienes conjugues,
J. Chim. Phys., 1981, 78, 99. [all data]
Bieri, Burger, et al., 1977
Bieri, G.; Burger, F.; Heilbronner, E.; Maier, J.P.,
Valence ionization enrgies of hydrocarbons,
Helv. Chim. Acta, 1977, 60, 2213. [all data]
Lossing and Traeger, 1975
Lossing, F.P.; Traeger, J.C.,
Stabilization in cyclopentadienyl, cyclopentenyl, and cyclopentyl cations,
J. Am. Chem. Soc., 1975, 97, 1579. [all data]
Beez, Bieri, et al., 1973
Beez, M.; Bieri, G.; Bock, H.; Heilbronner, E.,
The ionization potentials of butadiene, hexatriene, andtheir methyl derivatives: evidence for through space interaction between double bond π-orbitals and non-bonded pseudo-π orbitals of methyl groups?,
Helv. Chim. Acta, 1973, 56, 1028. [all data]
Dewar and Worley, 1968
Dewar, M.J.S.; Worley, S.D.,
Ionization potential of cis-1,3-butadiene,
J. Chem. Phys., 1968, 49, 2454. [all data]
Franklin and Mogenis, 1967
Franklin, J.L.; Mogenis, A.,
An electron impact study of ions from several dienes,
J. Phys. Chem., 1967, 71, 2820. [all data]
Lossing and Traeger, 1975, 2
Lossing, F.P.; Traeger, J.C.,
Free radicals by mass spectrometry XLVI. Heats of formation of C5H7 and C5H9 radicals and cations.,
J. Am. Chem. Soc., 1975, 19, 9. [all data]