3-Penten-1-yne, (E)-
- Formula: C5H6
- Molecular weight: 66.1011
- IUPAC Standard InChIKey: XAJOPMVSQIBJCW-SNAWJCMRSA-N
- CAS Registry Number: 2004-69-5
- Chemical structure:
View 3d structure (requires JavaScript / HTML 5) - Stereoisomers:
- Other names: trans-2-Penten-4-Yne; trans-3-Penten-1-Yne; (E)-3-Penten-1-yne; (E)-CH3CH=CHC≡CH; Pent-1-yn-3-ene, (E)-; 3-Pentene-1-yne, (E)-

Gas phase thermochemistry data

Data compiled by: Hussein Y. Afeefy, Joel F. Liebman, and Stephen E. Stein
Quantity | Value | Units | Method | Reference | Comment |
---|---|---|---|---|---|
ΔfH°gas | 259. | kJ/mol | Chyd | Roth, Adamczak, et al., 1991 |

Phase change data

Data compiled by: Thermodynamics Research Center, NIST Boulder Laboratories, Chris Muzny director
Quantity | Value | Units | Method | Reference | Comment |
---|---|---|---|---|---|
Tboil | 323.65 | K | N/A | Skinner and Snelson, 1959 | Uncertainty assigned by TRC = 1. K; ~ |
Tboil | 325.05 | K | N/A | Pomerantz, Fookson, et al., 1954 | Uncertainty assigned by TRC = 0.4 K |

Reaction thermochemistry data

Data compiled by: Hussein Y. Afeefy, Joel F. Liebman, and Stephen E. Stein
Individual Reactions
By formula: 3H2 + C5H6 = C5H12
Quantity | Value | Units | Method | Reference | Comment |
---|---|---|---|---|---|
ΔrH° | -406. ± 1. | kJ/mol | Chyd | Roth, Adamczak, et al., 1991 | liquid phase |
ΔrH° | -402. ± 2. | kJ/mol | Chyd | Skinner and Snelson, 1959, 2 | liquid phase; solvent: Acetic acid |
By formula: C5H6 = C5H6
Quantity | Value | Units | Method | Reference | Comment |
---|---|---|---|---|---|
ΔrH° | 4. ± 3. | kJ/mol | Eqk | Roth, Hopf, et al., 1994 | gas phase; At 959 K |

Gas phase ion energetics data

Data compiled by: Sharon G. Lias, Rhoda D. Levin, and Sherif A. Kafafi
Ionization energy determinations
IE (eV) | Method | Reference | Comment |
---|---|---|---|
9.05 ± 0.01 | DER | Carlier, Mouvier, et al., 1979 | |
9.1 ± 0.1 | PE | Bieri, Burger, et al., 1977 | Vertical value |
9.11 ± 0.03 | PE | Van Hoorn, 1975 | Vertical value |

References

Roth, Adamczak, et al., 1991
Roth, W.R.; Adamczak, O.; Breuckmann, R.; Lennartz, H.-W.; Boese, R.,
Die Berechnung von Resonanzenergien; das MM2ERW-Kraftfeld,
Chem. Ber., 1991, 124, 2499-2521. [all data]
Skinner and Snelson, 1959
Skinner, H.A.; Snelson, A.,
Heats of Hydrogenation. Part 3,
Trans. Faraday Soc., 1959, 55, 404. [all data]
Pomerantz, Fookson, et al., 1954
Pomerantz, P.; Fookson, A.; Mears, T.W.; Rothberg, S.; Howard, F.L.,
Synthesis and Physical Properties of Several Acetylenic Hydrocarbons,
J. Res. Natl. Bur. Stand. (U. S.), 1954, 52, 51. [all data]
Skinner and Snelson, 1959, 2
Skinner, H.A.; Snelson, A.,
Heats of hydrogenation Part 3.,
Trans. Faraday Soc., 1959, 55, 405-407. [all data]
Roth, Hopf, et al., 1994
Roth, W.R.; Hopf, H.; Horn, C.,
Propargyl-Stabilisierungsenergie,
Chem. Ber., 1994, 127, 1781-1795. [all data]
Carlier, Mouvier, et al., 1979
Carlier, P.; Mouvier, G.; Mesnard, D.; Miginiac, L.,
Etude par spectrometrie de photoelectrons de la structure electronique des phenyl-alcynes conjugues,
J. Electron Spectrosc. Relat. Phenom., 1979, 16, 147. [all data]
Bieri, Burger, et al., 1977
Bieri, G.; Burger, F.; Heilbronner, E.; Maier, J.P.,
Valence ionization enrgies of hydrocarbons,
Helv. Chim. Acta, 1977, 60, 2213. [all data]
Van Hoorn, 1975
Van Hoorn, M.D.,
He(I) ionisation potentials and MO calculations of butenyne and the monomethyl-substituted butenynes,
J. Electron Spectrosc. Relat. Phenom., 1975, 6, 65. [all data]