Trisilane,1,1,1,2,3,3,3-heptamethyl-2-(trimethylsilyl)-
- Formula: C10H30Si4
- Molecular weight: 262.6872
- IUPAC Standard InChIKey: PITNOWUEKMGZFG-UHFFFAOYSA-N
- CAS Registry Number: 2003-86-3
- Chemical structure:
View 3d structure (requires JavaScript / HTML 5) - Permanent link for this species. Use this link for bookmarking this species for future reference.

Gas phase ion energetics data

Data compiled by: Henry M. Rosenstock, Keith Draxl, Bruce W. Steiner, and John T. Herron
Ionization energy determinations
IE (eV) | Method | Reference |
---|---|---|
7.41 ± 0.01 | EI | Pitt, Bursey, et al., 1970 |

References

Pitt, Bursey, et al., 1970
Pitt, C.G.; Bursey, M.M.; Rogerson, P.F.,
Catenates of the group IV elements. Correlation of σ electron energies,
J. Am. Chem. Soc., 1970, 92, 519. [all data]