Benzyl 3-methoxyphenyl ether
- Formula: C14H14O2
- Molecular weight: 214.2598
- IUPAC Standard InChIKey: RWYJUAVONVYHPV-UHFFFAOYSA-N
- CAS Registry Number: 19962-23-3
- Chemical structure:
View 3d structure (requires JavaScript / HTML 5) - Permanent link for this species. Use this link for bookmarking this species for future reference.

Gas phase ion energetics data

Data compiled by: Henry M. Rosenstock, Keith Draxl, Bruce W. Steiner, and John T. Herron
Ionization energy determinations
IE (eV) | Method | Reference |
---|---|---|
8.3 | EI | Ward, Cooks, et al., 1969 |
Appearance energy determinations
Ion | AE (eV) | Other Products | Method | Reference | Comment |
---|---|---|---|---|---|
C7H7+ | 10.1 | ? | EI | Ward, Cooks, et al., 1969 | |
C7H7O2+ | 10.4 | ? | EI | Ward, Cooks, et al., 1969 |

References

Ward, Cooks, et al., 1969
Ward, R.S.; Cooks, R.d.; Williams, D.H.,
Substituent effects in mass spectrometry. Mass spectra of substituted phenyl benzyl ethers,
J. Am. Chem. Soc., 1969, 91, 2727. [all data]