2,2,7,7-Tetramethyl-octa-3,4,5,6-tetraone
- Formula: C12H18O4
- Molecular weight: 226.2689
- IUPAC Standard InChIKey: VZPFAZLOXSSWIR-UHFFFAOYSA-N
- CAS Registry Number: 19909-70-7
- Chemical structure:
View 3d structure (requires JavaScript / HTML 5) - Permanent link for this species. Use this link for bookmarking this species for future reference.

Gas phase ion energetics data

Data compiled as indicated in comments:
LBLHLM - Sharon G. Lias, John E. Bartmess, Joel F. Liebman, John L. Holmes, Rhoda D. Levin, and W. Gary Mallard
Ionization energy determinations
IE (eV) | Method | Reference | Comment |
---|---|---|---|
8.5 | PE | Gleiter and Dobler, 1985 | LBLHLM |
8.84 | PE | Gleiter and Dobler, 1985 | Vertical value; LBLHLM |

References

Gleiter and Dobler, 1985
Gleiter, R.; Dobler, W.,
Die elektronenstruktur von 1,4-disubstituierten butantetronen,
Chem. Ber., 1985, 118, 1917. [all data]