Butanetetrone, bis(2,4,6-trimethylphenyl)-
- Formula: C22H22O4
- Molecular weight: 350.4077
- IUPAC Standard InChIKey: OKPHOCZMMHASKA-UHFFFAOYSA-N
- CAS Registry Number: 19909-65-0
- Chemical structure:
View 3d structure (requires JavaScript / HTML 5) - Permanent link for this species. Use this link for bookmarking this species for future reference.

Gas phase ion energetics data

Data compiled as indicated in comments:
LBLHLM - Sharon G. Lias, John E. Bartmess, Joel F. Liebman, John L. Holmes, Rhoda D. Levin, and W. Gary Mallard
Ionization energy determinations
IE (eV) | Method | Reference | Comment |
---|---|---|---|
8.6 | PE | Gleiter and Dobler, 1985 | Vertical value; LBLHLM |

References

Gleiter and Dobler, 1985
Gleiter, R.; Dobler, W.,
Die elektronenstruktur von 1,4-disubstituierten butantetronen,
Chem. Ber., 1985, 118, 1917. [all data]