Tetrakis(dimethylamino)vanadium
- Formula: C8H24N4V
- Molecular weight: 227.2445
- IUPAC Standard InChIKey: PALZAXLZULBBHA-UHFFFAOYSA-N
- CAS Registry Number: 19824-56-7
- Chemical structure:
View 3d structure (requires JavaScript / HTML 5) - Other names: Vanadium, tetrakis(dimethylamino)-

Gas phase ion energetics data

Data compiled by: Sharon G. Lias, Rhoda D. Levin, and Sherif A. Kafafi
Ionization energy determinations
IE (eV) | Method | Reference | Comment |
---|---|---|---|
6.2 | PE | Gibbins, Lappert, et al., 1975 | Vertical value |

References

Gibbins, Lappert, et al., 1975
Gibbins, S.G.; Lappert, M.F.; Pedley, J.B.; Sharp, G.J.,
Bonding studies of transition-metal complexes. Part II. Helium-I photoelectron spectra of homoleptic d0, d1, and d10 tetrakis(dialkylamides) of transition group 4B metals tungsten hexakis(dimethylamide),
J. Chem. Soc. Dalton Trans., 1975, 72. [all data]