Hafnium, tetrakis(diethylamino)-
- Formula: C16H40HfN4
- Molecular weight: 467.01
- CAS Registry Number: 19824-55-6

Gas phase thermochemistry data

Data compiled by: José A. Martinho Simões
Quantity | Value | Units | Method | Reference | Comment |
---|---|---|---|---|---|
ΔfH°gas | -572. ± 29. | kJ/mol | Review | Martinho Simões | The enthalpy of formation relies -1852. ± 16. kJ/mol for the enthalpy of formation of crystalline Hf(O-i-Pr)4 |

Condensed phase thermochemistry data

Data compiled by: José A. Martinho Simões
Quantity | Value | Units | Method | Reference | Comment |
---|---|---|---|---|---|
ΔfH°liquid | -639. ± 27. | kJ/mol | Review | Martinho Simões | The enthalpy of formation relies -1852. ± 16. kJ/mol for the enthalpy of formation of crystalline Hf(O-i-Pr)4 |

Gas phase ion energetics data

Data compiled by: Sharon G. Lias, Rhoda D. Levin, and Sherif A. Kafafi
Ionization energy determinations
IE (eV) | Method | Reference | Comment |
---|---|---|---|
7.15 | PE | Gibbins, Lappert, et al., 1975 | Vertical value |

Phase change data

Data compiled by: José A. Martinho Simões
Quantity | Value | Units | Method | Reference | Comment |
---|---|---|---|---|---|
ΔvapH° | 66.9 ± 8.4 | kJ/mol | RSC | Lappert, Patil, et al., 1975 |

References

Martinho Simões
Martinho Simões, J.A.,
Private communication (see http://webbook.nist.gov/chemistry/om/). [all data]
Gibbins, Lappert, et al., 1975
Gibbins, S.G.; Lappert, M.F.; Pedley, J.B.; Sharp, G.J.,
Bonding studies of transition-metal complexes. Part II. Helium-I photoelectron spectra of homoleptic d0, d1, and d10 tetrakis(dialkylamides) of transition group 4B metals tungsten hexakis(dimethylamide),
J. Chem. Soc. Dalton Trans., 1975, 72. [all data]