2-Butenal, 2-ethyl-
- Formula: C6H10O
- Molecular weight: 98.1430
- IUPAC Standard InChIKey: IQGZCSXWIRBTRW-UHFFFAOYSA-N
- CAS Registry Number: 19780-25-7
- Chemical structure:
View 3d structure (requires JavaScript / HTML 5) - Stereoisomers:
- Other names: CH3CH=C(C2H5)CHO; Crotonaldehyde, 2-ethyl-; 2-Ethylcrotonaldehyde; 2-Ethyl-2-butenal

Gas phase ion energetics data

Data compiled as indicated in comments:
LLK - Sharon G. Lias, Rhoda D. Levin, and Sherif A. Kafafi
Ionization energy determinations
IE (eV) | Method | Reference | Comment |
---|---|---|---|
9.53 | PE | Masclet and Mouvier, 1978 | LLK |

Kovats' RI, non-polar column, isothermal

Column type | Active phase | Temperature (C) | I | Reference | Comment |
---|---|---|---|---|---|
Packed | Apiezon L | 120. | 793. | Bogoslovsky, Anvaer, et al., 1978 | Celite 545 |
Packed | Apiezon L | 160. | 808. | Bogoslovsky, Anvaer, et al., 1978 | Celite 545 |

Normal alkane RI, polar column, temperature ramp

Column type | Active phase | I | Reference | Comment |
---|---|---|---|---|
Capillary | DB-Wax | 1145. | Umano, Hagi, et al., 1995 | He, 40. C @ 2. min, 2. K/min; Column length: 60. m; Column diameter: 0.25 mm; Tend: 200. C |

References

Masclet and Mouvier, 1978
Masclet, P.; Mouvier, G.,
Etude par spectrometrie photoelectronique d'aldehydes et de cetones ethyleniques conjugues,
J. Electron Spectrosc. Relat. Phenom., 1978, 14, 77. [all data]
Bogoslovsky, Anvaer, et al., 1978
Bogoslovsky, Yu.N.; Anvaer, B.I.; Vigdergauz, M.S.,
Chromatographic constants in gas chromatography (in Russian), Standards Publ. House, Moscow, 1978, 192. [all data]
Umano, Hagi, et al., 1995
Umano, K.; Hagi, Y.; Nakahara, K.; Shyoji, A.; Shibamoto, T.,
Volatile chemicals formed in the headspace of a heated D-glucose/L-cysteine Maillard model system,
J. Agric. Food Chem., 1995, 43, 8, 2212-2218, https://doi.org/10.1021/jf00056a046
. [all data]