Zirconium, tetrakis(dimethylamino)-
- Formula: C8H24N4Zr
- Molecular weight: 267.527
- CAS Registry Number: 19756-04-8

Condensed phase thermochemistry data

Data compiled by: José A. Martinho Simões
Quantity | Value | Units | Method | Reference | Comment |
---|---|---|---|---|---|
ΔfH°solid | -363. ± 17. | kJ/mol | Review | Martinho Simões | The enthalpy of formation relies on -1796. ± 15. kJ/mol for the enthalpy of formation of Zr(O-i-Pr)4(cr) |

Phase change data

Data compiled by: José A. Martinho Simões
Quantity | Value | Units | Method | Reference | Comment |
---|---|---|---|---|---|
ΔsubH° | 71.1 ± 8.4 | kJ/mol | RSC | Lappert, Patil, et al., 1975 |

Gas phase ion energetics data

Data compiled by: Sharon G. Lias, Rhoda D. Levin, and Sherif A. Kafafi
Ionization energy determinations
IE (eV) | Method | Reference | Comment |
---|---|---|---|
7.23 | PE | Gibbins, Lappert, et al., 1975 | Vertical value |

Gas phase thermochemistry data

Data compiled by: José A. Martinho Simões
Quantity | Value | Units | Method | Reference | Comment |
---|---|---|---|---|---|
ΔfH°gas | -292. ± 19. | kJ/mol | Review | Martinho Simões | The enthalpy of formation relies on -1796. ± 15. kJ/mol for the enthalpy of formation of Zr(O-i-Pr)4(cr) |

References

Martinho Simões
Martinho Simões, J.A.,
Private communication (see http://webbook.nist.gov/chemistry/om/). [all data]
Lappert, Patil, et al., 1975
Lappert, M.F.; Patil, D.S.; Pedley, J.B.,
J. Chem. Soc., Chem. Commun., 1975, 830.. [all data]
Gibbins, Lappert, et al., 1975
Gibbins, S.G.; Lappert, M.F.; Pedley, J.B.; Sharp, G.J.,
Bonding studies of transition-metal complexes. Part II. Helium-I photoelectron spectra of homoleptic d0, d1, and d10 tetrakis(dialkylamides) of transition group 4B metals tungsten hexakis(dimethylamide),
J. Chem. Soc. Dalton Trans., 1975, 72. [all data]