1-Methyl-octahydroazocine
- Formula: C8H17N
- Molecular weight: 127.2273
- IUPAC Standard InChIKey: CAROGVXIVVOPKA-UHFFFAOYSA-N
- CAS Registry Number: 19719-81-4
- Chemical structure:
View 3d structure (requires JavaScript / HTML 5) - Permanent link for this species. Use this link for bookmarking this species for future reference.

Gas phase ion energetics data

Data compiled by: Sharon G. Lias, John E. Bartmess, Joel F. Liebman, John L. Holmes, Rhoda D. Levin, and W. Gary Mallard
Ionization energy determinations
IE (eV) | Method | Reference | Comment |
---|---|---|---|
8.02 | PE | Spanka, Boese, et al., 1987 | Vertical value |
8.02 | PE | Spanka and Rademacher, 1986 | Vertical value |

Normal alkane RI, non-polar column, custom temperature program

Column type | Active phase | I | Reference | Comment |
---|---|---|---|---|
Capillary | Methyl Silicone | 970. | Farkas, Héberger, et al., 2004 | Program: not specified |

References

Spanka, Boese, et al., 1987
Spanka, G.; Boese, R.; Rademacher, P.,
Transannualr interactions in difunctional medium rings. 2. Molecular structure and conformational properties of 1-alkylhexahydroazocin-5-ones,
J. Org. Chem., 1987, 52, 3362. [all data]
Spanka and Rademacher, 1986
Spanka, G.; Rademacher, P.,
Transannular interactions in difunctional medium rings. 1. n/π Interactions in cyclic amino ketones and aminoalkenes studied by photoelectron spectroscopy,
J. Org. Chem., 1986, 51, 592. [all data]
Farkas, Héberger, et al., 2004
Farkas, O.; Héberger, K.; Zenkevich, I.G.,
Quantitative structure-retention relationships. XIV. Prediction of gas chromatographic retention indices for saturated O-, N-, and S-heterocyclic compounds,
Chemom. Intell. Lab. Syst., 2004, 72, 2, 173-184, https://doi.org/10.1016/j.chemolab.2004.01.012
. [all data]