Carbonodithioic acid, O,S-dimethyl ester
- Formula: C3H6OS2
- Molecular weight: 122.209
- IUPAC Standard InChIKey: LABVNFAVENLDHB-UHFFFAOYSA-N
- CAS Registry Number: 19708-81-7
- Chemical structure:
View 3d structure (requires JavaScript / HTML 5) - Other names: Carbonic acid, dithio-, O,S-dimethyl ester; Dimethyl xanthate; Methyl O-methylxanthate; Methyl S-methyl xanthate; O-Methyl S-methyl dithiocarbonate; O,S-Dimethyl dithiocarbonate

Gas phase ion energetics data

Data evaluated as indicated in comments:
HL - Edward P. Hunter and Sharon G. Lias
Data compiled as indicated in comments:
LLK - Sharon G. Lias, Rhoda D. Levin, and Sherif A. Kafafi
Quantity | Value | Units | Method | Reference | Comment |
---|---|---|---|---|---|
Proton affinity (review) | 862.6 | kJ/mol | N/A | Hunter and Lias, 1998 | HL |
Quantity | Value | Units | Method | Reference | Comment |
Gas basicity | 830.8 | kJ/mol | N/A | Hunter and Lias, 1998 | HL |
Ionization energy determinations
IE (eV) | Method | Reference | Comment |
---|---|---|---|
8.71 | PE | Guimon, Gonbeau, et al., 1974 | Vertical value; LLK |

References

Hunter and Lias, 1998
Hunter, E.P.; Lias, S.G.,
Evaluated Gas Phase Basicities and Proton Affinities of Molecules: An Update,
J. Phys. Chem. Ref. Data, 1998, 27, 3, 413-656, https://doi.org/10.1063/1.556018
. [all data]
Guimon, Gonbeau, et al., 1974
Guimon, C.; Gonbeau, D.; Pfister-Guillouzo, G.; Asbrink, L.; Sandstrom, J.,
Electronic structure of sulphur compounds. VI. Photoelectron spectra of some simple thiocarbonyl compounds,
J. Electron Spectrosc. Relat. Phenom., 1974, 4, 49. [all data]