2-Propanol, 1-bromo-
- Formula: C3H7BrO
- Molecular weight: 138.991
- IUPAC Standard InChIKey: WEGOLYBUWCMMMY-UHFFFAOYSA-N
- CAS Registry Number: 19686-73-8
- Chemical structure:
View 3d structure (requires JavaScript / HTML 5) - Other names: 1-Bromo-2-propanol; 2-Hydroxy-2-methylethyl bromide; 2-Hydroxypropyl bromide; Propylene bromohydrin; 1-Bromo-2-hydroxypropane; 1-bromopropan-2-ol

Phase change data

Data compiled by: Robert L. Brown and Stephen E. Stein
Quantity | Value | Units | Method | Reference | Comment |
---|---|---|---|---|---|
Tboil | 419.7 | K | N/A | Weast and Grasselli, 1989 |

Gas phase ion energetics data

Data compiled by: Sharon G. Lias and Joel F. Liebman
Appearance energy determinations
Ion | AE (eV) | Other Products | Method | Reference | Comment |
---|---|---|---|---|---|
C2H5O+ | 10.34 | CH2Br | EI | Holmes and Lossing, 1988 |

References

Weast and Grasselli, 1989
CRC Handbook of Data on Organic Compounds, 2nd Editon, Weast,R.C and Grasselli, J.G., ed(s)., CRC Press, Inc., Boca Raton, FL, 1989, 1. [all data]
Holmes and Lossing, 1988
Holmes, J.L.; Lossing, F.P.,
Heats of formation and bond dissociation energies in halogen-substituted methyl and ethyl radicals,
J. Am. Chem. Soc., 1988, 110, 7343. [all data]