Benzo(g)chrysene
- Formula: C22H14
- Molecular weight: 278.3466
- IUPAC Standard InChIKey: JZOIZKBKSZMVRV-UHFFFAOYSA-N
- CAS Registry Number: 196-78-1
- Chemical structure:
View 3d structure (requires JavaScript / HTML 5) - Other names: 1,2:3,4-Dibenzophenanthrene

Gas phase thermochemistry data

Data compiled by: Glushko Thermocenter, Russian Academy of Sciences, Moscow
Constant pressure heat capacity of gas
Cp,gas (J/mol*K) | Temperature (K) | Reference | Comment |
---|---|---|---|
57.57 | 50. | Dorofeeva O.V., 1988 | Recommended values were calculated statistically mechanically using force field approximation for polycyclic aromatic hydrocarbons to estimate the needed vibrational frequencies (see also [ Dorofeeva O.V., 1986, Moiseeva N.F., 1989]). These functions are reproduced in the reference book [ Frenkel M., 1994]. |
95.53 | 100. | ||
137.98 | 150. | ||
185.63 | 200. | ||
260.44 | 273.15 | ||
286.1 ± 3.5 | 298.15 | ||
288.01 | 300. | ||
384.24 | 400. | ||
464.63 | 500. | ||
528.95 | 600. | ||
580.31 | 700. | ||
621.83 | 800. | ||
655.87 | 900. | ||
684.11 | 1000. | ||
707.77 | 1100. | ||
727.74 | 1200. | ||
744.71 | 1300. | ||
759.21 | 1400. | ||
771.66 | 1500. |

Gas phase ion energetics data

Data compiled by: Henry M. Rosenstock, Keith Draxl, Bruce W. Steiner, and John T. Herron
Ionization energy determinations
IE (eV) | Method | Reference |
---|---|---|
7.57 | CTS | Matsen, 1956 |

References

Dorofeeva O.V., 1988
Dorofeeva O.V.,
Thermodynamic Properties of Polycyclic Aromatic Hydrocarbons in the Gaseous Phase. Institute for High Temperatures, USSR Academy of Sciences, Preprint No.1-238 (in Russian), Moscow, 1988. [all data]
Dorofeeva O.V., 1986
Dorofeeva O.V.,
On calculation of thermodynamic properties of polycyclic aromatic hydrocarbons,
Thermochim. Acta, 1986, 102, 59-66. [all data]
Moiseeva N.F., 1989
Moiseeva N.F.,
Development of Benson group additivity method for estimation of ideal gas thermodynamic properties of polycyclic aromatic hydrocarbons,
Thermochim. Acta, 1989, 153, 77-85. [all data]
Frenkel M., 1994
Frenkel M.,
Thermodynamics of Organic Compounds in the Gas State, Vol. I, II, Thermodynamics Research Center, College Station, Texas, 1994, 1994. [all data]
Matsen, 1956
Matsen, F.A.,
Electron affinities, methyl affinities, and ionization energies of condensed ring aromatic hydrocarbons,
J. Chem. Phys., 1956, 24, 602. [all data]