Naphtho[2,3-g]chrysene
- Formula: C26H16
- Molecular weight: 328.4052
- IUPAC Standard InChIKey: JBHIIKGZANVCJJ-UHFFFAOYSA-N
- CAS Registry Number: 196-64-5
- Chemical structure:
View 3d structure (requires JavaScript / HTML 5) - Permanent link for this species. Use this link for bookmarking this species for future reference.

Gas phase ion energetics data

Data compiled by: Sharon G. Lias, Rhoda D. Levin, and Sherif A. Kafafi
Ionization energy determinations
IE (eV) | Method | Reference | Comment |
---|---|---|---|
7.15 ± 0.04 | PE | Boschi, Clar, et al., 1974 | |
7.15 ± 0.02 | PE | Schmidt, 1977 | Vertical value |

Lee's RI, non-polar column, custom temperature program

Column type | Active phase | I | Reference | Comment |
---|---|---|---|---|
Capillary | CP Sil 8 CB | 567.36 | Bemgard, Colmsjo, et al., 1992 | Column length: 25. m; Column diameter: 0.32 mm; Program: 140C (2min) => (rapidly) => 200C(2min) => 5C/min => 370C |
Capillary | XTI-5 | 575.96 | Bemgard, Colmsjo, et al., 1992 | Column length: 15. m; Column diameter: 0.28 mm; Program: 140C (2min) => (rapidly) => 200C(2min) => 5C/min => 370C |

References

Boschi, Clar, et al., 1974
Boschi, R.; Clar, E.; Schmidt, W.,
Photoelectron spectra of polynuclear aromatics. III. The effect of nonplanarity in sterically overcrowded aromatic hydrocarbons,
J. Chem. Phys., 1974, 60, 4406. [all data]
Schmidt, 1977
Schmidt, W.,
Photoelectron spectra of polynuclear aromatics. V. Correlations with ultraviolet absorption spectra in the catacondensed series,
J. Chem. Phys., 1977, 66, 828. [all data]
Clar and Kelly, 1957
Clar, E.; Kelly, W.,
J. Chem. Soc., 1957, 4163. [all data]
Bemgard, Colmsjo, et al., 1992
Bemgard, A.; Colmsjo, A.; Lundmark, B.-O.,
Gas chromatographic analysis of high-molecular-weight polynuclear aromatic hydrocarbons. I. Molecular weight 328,
J. Chromatogr., 1992, 595, 1-2, 247-258, https://doi.org/10.1016/0021-9673(92)85167-R
. [all data]