1-Methyloctahydroazecin-6-one
- Formula: C10H19NO
- Molecular weight: 169.2640
- IUPAC Standard InChIKey: OIJNRMULDOGMMI-UHFFFAOYSA-N
- CAS Registry Number: 19641-26-0
- Chemical structure:
View 3d structure (requires JavaScript / HTML 5) - Permanent link for this species. Use this link for bookmarking this species for future reference.

Gas phase ion energetics data

Data compiled by: Sharon G. Lias, John E. Bartmess, Joel F. Liebman, John L. Holmes, Rhoda D. Levin, and W. Gary Mallard
Ionization energy determinations
IE (eV) | Method | Reference | Comment |
---|---|---|---|
8.20 | PE | Spanka and Rademacher, 1986 | Vertical value |

References

Spanka and Rademacher, 1986
Spanka, G.; Rademacher, P.,
Transannular interactions in difunctional medium rings. 1. n/π Interactions in cyclic amino ketones and aminoalkenes studied by photoelectron spectroscopy,
J. Org. Chem., 1986, 51, 592. [all data]