Pyridine, 1-acetyl-1,2,3,4-tetrahydro-
- Formula: C7H11NO
- Molecular weight: 125.1683
- IUPAC Standard InChIKey: ZGKNRILGBQAZDJ-UHFFFAOYSA-N
- CAS Registry Number: 19615-27-1
- Chemical structure:
View 3d structure (requires JavaScript / HTML 5) - Other names: 1-Acetyl-1,2,3,4-tetrahydropyridine

Gas phase ion energetics data

Data compiled by: Sharon G. Lias, Rhoda D. Levin, and Sherif A. Kafafi
Ionization energy determinations
IE (eV) | Method | Reference |
---|---|---|
8.8 | EI | Schwarz and Bohlmann, 1973 |
Appearance energy determinations
Ion | AE (eV) | Other Products | Method | Reference | Comment |
---|---|---|---|---|---|
C2H3O+ | 13.5 | ? | EI | Schwarz and Bohlmann, 1973 |

References

Schwarz and Bohlmann, 1973
Schwarz, H.; Bohlmann, F.,
Massenspektrometrische untersuchung von amiden. I. Energetische betrachtungen zur elektronenstrossin-duzierten fragmentierung von piperidin- und piperidein- amiden,
Org. Mass Spectrom., 1973, 7, 1197. [all data]