Acetamide,N-(2-iodophenyl)-
- Formula: C8H8INO
- Molecular weight: 261.0597
- IUPAC Standard InChIKey: BCJOKHQYEDXBSF-UHFFFAOYSA-N
- CAS Registry Number: 19591-17-4
- Chemical structure:
View 3d structure (requires JavaScript / HTML 5) - Other names: Acetanilide, 2'-iodo-; 2'-Iodoacetanilide; N-(2-Iodophenyl)acetamide; N-Acetyl-2-iodoaniline; o-Iodoacetanilide

Gas phase ion energetics data

Data compiled by: Sharon G. Lias, Rhoda D. Levin, and Sherif A. Kafafi
Ionization energy determinations
IE (eV) | Method | Reference |
---|---|---|
8.45 | EI | Baldwin, Loudon, et al., 1976 |
7.98 ± 0.03 | EI | Benezra and Bursey, 1971 |
Appearance energy determinations
Ion | AE (eV) | Other Products | Method | Reference | Comment |
---|---|---|---|---|---|
C2H3O+ | 13.56 ± 0.03 | ? | EI | Benezra and Bursey, 1971 | |
C6H6NI+ | 10.48 ± 0.03 | CH2=C=O | EI | Benezra and Bursey, 1971 | |
C8H8NO+ | 9.30 | I | EI | Baldwin, Loudon, et al., 1976 | |
C8H8NO+ | 8.57 ± 0.03 | I | EI | Benezra and Bursey, 1971 |

References

Baldwin, Loudon, et al., 1976
Baldwin, M.A.; Loudon, A.G.; Maccoll, A.; Webb, K.S.,
The nature and fragmentation pathways of the molecular ions of some arylureas, arylthioureas, acetanilides, thioacetanilides and related compounds,
Org. Mass Spectrom., 1976, 11, 1181. [all data]
Benezra and Bursey, 1971
Benezra, S.A.; Bursey, M.M.,
ortho-Effects on ordering factors in mass spectral rearrangements. Loss of keten from halogenated phenyl acetates and acetanilides,
J. Chem. Soc. B, 1971, 1515. [all data]