2,3:8,9-Dibenzochrysene
- Formula: C26H16
- Molecular weight: 328.4052
- IUPAC Standard InChIKey: DHCSBRKYHMINPB-UHFFFAOYSA-N
- CAS Registry Number: 195-00-6
- Chemical structure:
View 3d structure (requires JavaScript / HTML 5) - Species with the same structure:

Gas phase ion energetics data

Data compiled by: Henry M. Rosenstock, Keith Draxl, Bruce W. Steiner, and John T. Herron
Ionization energy determinations
IE (eV) | Method | Reference |
---|---|---|
6.92 | CTS | Matsen, 1956 |

References

Matsen, 1956
Matsen, F.A.,
Electron affinities, methyl affinities, and ionization energies of condensed ring aromatic hydrocarbons,
J. Chem. Phys., 1956, 24, 602. [all data]