1,1'-Biphenyl, 2-(1-methylethyl)-
- Formula: C15H16
- Molecular weight: 196.2875
- IUPAC Standard InChIKey: HKTCLPBBJDIBGF-UHFFFAOYSA-N
- CAS Registry Number: 19486-60-3
- Chemical structure:
View 3d structure (requires JavaScript / HTML 5) - Other names: 1,1'-Biphenyl,2-isopropyl-

Condensed phase thermochemistry data

Data compiled by: Hussein Y. Afeefy, Joel F. Liebman, and Stephen E. Stein
Quantity | Value | Units | Method | Reference | Comment |
---|---|---|---|---|---|
ΔcH°liquid | -7887. | kJ/mol | Ccb | Goodman and Wise, 1950 | Corresponding ΔfHºliquid = -300. kJ/mol (simple calculation by NIST; no Washburn corrections) |

Phase change data

Data compiled by: Thermodynamics Research Center, NIST Boulder Laboratories, Chris Muzny director
Quantity | Value | Units | Method | Reference | Comment |
---|---|---|---|---|---|
Tboil | 542.92 | K | N/A | Goodman and Wise, 1951 | Uncertainty assigned by TRC = 0.3 K |
Tboil | 542.92 | K | N/A | Goodman and Wise, 1950, 2 | Uncertainty assigned by TRC = 0.15 K |
Quantity | Value | Units | Method | Reference | Comment |
Tfus | 297.61 | K | N/A | Goodman and Wise, 1951 | Uncertainty assigned by TRC = 0.1 K |
Tfus | 297.61 | K | N/A | Goodman and Wise, 1950, 2 | Uncertainty assigned by TRC = 0.15 K |

Reaction thermochemistry data

Data compiled by: Hussein Y. Afeefy, Joel F. Liebman, and Stephen E. Stein
Individual Reactions
By formula: C15H16 = C15H16
Quantity | Value | Units | Method | Reference | Comment |
---|---|---|---|---|---|
ΔrH° | -15.4 | kJ/mol | Eqk | Roshchupkina, Nesterova, et al., 1987 | liquid phase; T=367 K |

Gas phase ion energetics data

Data compiled by: Sharon G. Lias, Rhoda D. Levin, and Sherif A. Kafafi
Ionization energy determinations
IE (eV) | Method | Reference | Comment |
---|---|---|---|
8.50 ± 0.02 | PE | Maier and Turner, 1972 | Vertical value |

Kovats' RI, non-polar column, isothermal

Column type | Active phase | Temperature (C) | I | Reference | Comment |
---|---|---|---|---|---|
Packed | Apiezon L | 170. | 1500. | Kríz, Popl, et al., 1974 | |
Packed | Apiezon L | 185. | 1512. | Kríz, Popl, et al., 1974 |

Kovats' RI, polar column, isothermal

Column type | Active phase | Temperature (C) | I | Reference | Comment |
---|---|---|---|---|---|
Capillary | SP-1000 | 185. | 2015. | Kríz, Popl, et al., 1974 | N2; Column length: 50. m; Column diameter: 0.25 mm |
Capillary | SP-1000 | 200. | 1980. | Kríz, Popl, et al., 1974 | N2; Column length: 50. m; Column diameter: 0.25 mm |

References

Goodman and Wise, 1950
Goodman, I.A.; Wise, P.H.,
Dicyclic hydrocarbons. I. 2-Aklylbiphenyls,
J. Am. Chem. Soc., 1950, 72, 3076-3078. [all data]
Goodman and Wise, 1951
Goodman, I.A.; Wise, P.H.,
Synthesis & purification of some alkylbiphenyls & alkylbicyclohexyls., Natl. Advis. Comm. Aeronaut., Tech. Note NACA TN 2260, Lewis Flight Propulsion Lab., Cleveland, Ohio, 1951. [all data]
Goodman and Wise, 1950, 2
Goodman, I.A.; Wise, P.H.,
Dicycloic Hydrocarbons I. 2-Alkylbiphenyls,
J. Am. Chem. Soc., 1950, 72, 3076. [all data]
Roshchupkina, Nesterova, et al., 1987
Roshchupkina, I.Yu.; Nesterova, T.N.; Rozhnov, A.M.,
Equilibria of isomeric transformations of alkylbiphenyls,
J. Chem. Thermodyn., 1987, 19, 299-306. [all data]
Maier and Turner, 1972
Maier, J.P.; Turner, D.W.,
Steric inhibition of resonance studied by molecular photoelectron spectroscopy. Part I. Biphenyls,
Faraday Discuss. Chem. Soc., 1972, 54, 149. [all data]
Kusakov, et al., 1963
Kusakov, M.M., et al.,
Ultraviolet Absorption Spectra of Aromatic Hydrocarbons, 1963, 185. [all data]
Kríz, Popl, et al., 1974
Kríz, J.; Popl, M.; Mostecký, J.,
Retention indices of biphenyls and diphenylalkanes,
J. Chromatogr., 1974, 97, 1, 3-13, https://doi.org/10.1016/S0021-9673(01)97577-6
. [all data]