Diazene, bis[4-(pentyloxy)phenyl]-, 1-oxide
- Formula: C22H30N2O3
- Molecular weight: 370.4852
- IUPAC Standard InChIKey: KJMATSUHPOPLMT-UHFFFAOYSA-N
- CAS Registry Number: 19482-05-4
- Chemical structure:

Phase change data

Data compiled by: Thermodynamics Research Center, NIST Boulder Laboratories, Chris Muzny director
Quantity | Value | Units | Method | Reference | Comment |
---|---|---|---|---|---|
Ttriple | 349. | K | N/A | Arnold, 1964 | Smectic liquid crystal phase; Uncertainty assigned by TRC = 0.1 K |

Gas phase ion energetics data

Data compiled as indicated in comments:
LLK - Sharon G. Lias, Rhoda D. Levin, and Sherif A. Kafafi
Ionization energy determinations
IE (eV) | Method | Reference | Comment |
---|---|---|---|
7.63 | PE | Millefiori, Ciliberto, et al., 1981 | Vertical value; LLK |

References

Arnold, 1964
Arnold, H.,
Calorimetry of crystalline-liquid materials: II results of the measurements on 12 homologous dialkoxy azeoxy benzenes,
Z. Phys. Chem. (Leipzig), 1964, 226, 146. [all data]
Millefiori, Ciliberto, et al., 1981
Millefiori, S.; Ciliberto, E.; Millefiori, A.; Zerbo, M.A.,
Gas phase U. V. photoelectron investigation of azoxybenzene and 4,4'-di(n-alkoxy)azoxybenzenes,
Spectromchim. Acta Part A, 1981, 37, 605. [all data]