Octaborane(12)

Gas phase ion energetics data

Data compiled by: Henry M. Rosenstock, Keith Draxl, Bruce W. Steiner, and John T. Herron

Ionization energy determinations

IE (eV) Method Reference
9.5 ± 0.1EISteck, Pressley, et al., 1970

References

Steck, Pressley, et al., 1970
Steck, S.J.; Pressley, G.A., Jr.; Stafford, F.E.; Dobson, J.; Schaeffer, R., Molecular-beam mass spectra of hexaborane(12) and octaborane(12), Inorg. Chem., 1970, 9, 2452. [all data]