trans-1,2-Diethenyl-1,2-dimethylcyclobutane
- Formula: C10H16
- Molecular weight: 136.2340
- IUPAC Standard InChIKey: ZASXJRHZTCKIAK-UHFFFAOYSA-N
- CAS Registry Number: 19465-00-0
- Chemical structure:
View 3d structure (requires JavaScript / HTML 5) - Permanent link for this species. Use this link for bookmarking this species for future reference.

Gas phase ion energetics data

Data compiled by: Henry M. Rosenstock, Keith Draxl, Bruce W. Steiner, and John T. Herron
Appearance energy determinations
Ion | AE (eV) | Other Products | Method | Reference | Comment |
---|---|---|---|---|---|
C5H8+ | 9.4 ± 0.1 | ? | EI | Brittain, Wells, et al., 1968 |

References

Brittain, Wells, et al., 1968
Brittain, E.F.H.; Wells, C.H.J.; Paisley, H.M.,
Mass spectra of isomers. Part I. Cyclobutanes and cyclohexenes of molecular formula C10H16,
J. Chem. Soc. B, 1968, 304. [all data]