Cyclohept[fg]acenaphthylene
- Formula: C16H10
- Molecular weight: 202.2506
- IUPAC Standard InChIKey: NIALEBRUYGMNAY-UHFFFAOYSA-N
- CAS Registry Number: 194-32-1
- Chemical structure:
View 3d structure (requires JavaScript / HTML 5) - Other names: Aceplaidylene

Reaction thermochemistry data

Data compiled by: Hussein Y. Afeefy, Joel F. Liebman, and Stephen E. Stein
Individual Reactions
By formula: 5H2 + C16H10 = C16H20
Quantity | Value | Units | Method | Reference | Comment |
---|---|---|---|---|---|
ΔrH° | -369.7 ± 1.9 | kJ/mol | Chyd | Turner, Lindsay, et al., 1971 | liquid phase |

Gas phase ion energetics data

Data compiled by: Sharon G. Lias, Rhoda D. Levin, and Sherif A. Kafafi
Ionization energy determinations
IE (eV) | Method | Reference |
---|---|---|
7.13 ± 0.04 | PE | Boschi, Clar, et al., 1974 |

References

Turner, Lindsay, et al., 1971
Turner, R.B.; Lindsay, W.S.; Boekelheide, V.,
Heats of hydrogenation acepleiadylene,
Tetrahedron, 1971, 27, 3341-3344. [all data]
Boschi, Clar, et al., 1974
Boschi, R.; Clar, E.; Schmidt, W.,
Photoelectron spectra of polynuclear aromatics. III. The effect of nonplanarity in sterically overcrowded aromatic hydrocarbons,
J. Chem. Phys., 1974, 60, 4406. [all data]