3,4,5,6-Tetrahydro-3,3,6,6-tetramethylpyridazine
- Formula: C8H16N2
- Molecular weight: 140.2260
- IUPAC Standard InChIKey: ZJQQXBVCDFWYGI-UHFFFAOYSA-N
- CAS Registry Number: 19403-24-8
- Chemical structure:
View 3d structure (requires JavaScript / HTML 5) - Permanent link for this species. Use this link for bookmarking this species for future reference.

Gas phase thermochemistry data

Data compiled by: Hussein Y. Afeefy, Joel F. Liebman, and Stephen E. Stein
Quantity | Value | Units | Method | Reference | Comment |
---|---|---|---|---|---|
ΔfH°gas | 10.0 ± 1.1 | kcal/mol | Ccb | Engel, Melaugh, et al., 1976 |

Condensed phase thermochemistry data

Data compiled by: Hussein Y. Afeefy, Joel F. Liebman, and Stephen E. Stein
Quantity | Value | Units | Method | Reference | Comment |
---|---|---|---|---|---|
ΔfH°liquid | -1.9 ± 1.1 | kcal/mol | Ccb | Engel, Melaugh, et al., 1976 | |
Quantity | Value | Units | Method | Reference | Comment |
ΔcH°liquid | -1297.0 ± 1.1 | kcal/mol | Ccb | Engel, Melaugh, et al., 1976 |

Phase change data

Data compiled as indicated in comments:
ALS - Hussein Y. Afeefy, Joel F. Liebman, and Stephen E. Stein
DRB - Donald R. Burgess, Jr.
Quantity | Value | Units | Method | Reference | Comment |
---|---|---|---|---|---|
ΔvapH° | 12.0 ± 0.1 | kcal/mol | V | Engel, Melaugh, et al., 1976 | ALS |
ΔvapH° | 11.9 | kcal/mol | N/A | Engel, Melaugh, et al., 1976 | DRB |

Gas phase ion energetics data

Data compiled by: Sharon G. Lias, Rhoda D. Levin, and Sherif A. Kafafi
Ionization energy determinations
IE (eV) | Method | Reference | Comment |
---|---|---|---|
7.89 | PE | Houk, Chang, et al., 1975 | Vertical value |

References

Engel, Melaugh, et al., 1976
Engel, P.S.; Melaugh, R.A.; Mansson, M.; Timberlake, J.W.; Garner, A.W.; Rossini, F.D.,
Thermochemistry of nine diazenes (azo compounds),
J. Chem. Thermodyn., 1976, 8, 607-621. [all data]
Houk, Chang, et al., 1975
Houk, K.N.; Chang, Y.-M.; Engel, P.S.,
Photoelectron spectroscopy of azo compounds,
J. Am. Chem. Soc., 1975, 97, 1824. [all data]