trans-4-Decene
- Formula: C10H20
- Molecular weight: 140.2658
- IUPAC Standard InChIKey: SOVOPSCRHKEUNJ-VQHVLOKHSA-N
- CAS Registry Number: 19398-89-1
- Chemical structure:
View 3d structure (requires JavaScript / HTML 5) - Stereoisomers:
- Other names: 4-Decene, (E)-; (4E)-4-Decene; (E)-4-C10H20; t-4-Decene; (E)-4-Decene; (E)-dec-4-ene

Gas phase ion energetics data

Data compiled as indicated in comments:
LLK - Sharon G. Lias, Rhoda D. Levin, and Sherif A. Kafafi
Ionization energy determinations
IE (eV) | Method | Reference | Comment |
---|---|---|---|
8.782 ± 0.004 | PI | Rang, Martinson, et al., 1974 | LLK |
8.97 ± 0.01 | PE | Krause, Taylor, et al., 1978 | Vertical value; LLK |

Kovats' RI, non-polar column, isothermal

Data compiled by: NIST Mass Spectrometry Data Center, William E. Wallace, director

Column type CapillaryCapillaryCapillaryCapillaryCapillary
Active phase SqualaneOV-101OV-101OV-101OV-101
Column length (m)     50.
Carrier gas     He
Substrate
Column diameter (mm)     0.25
Phase thickness (μm)
Temperature (C) 100.40.60.80.110.
I 982.991.991.991.992.
ReferenceHeinzen, Soares, et al., 1999Laub and Purnell, 1988Laub and Purnell, 1988Laub and Purnell, 1988Rang, Kuningas, et al., 1987
Comment MSDC-RI MSDC-RI MSDC-RI MSDC-RI MSDC-RI
Column type CapillaryCapillaryCapillaryCapillaryCapillary
Active phase SE-30SE-30OV-1SqualaneSqualane
Column length (m) 100.100.150.
Carrier gas   He
Substrate
Column diameter (mm) 0.50.50.50
Phase thickness (μm)
Temperature (C) 130.80.60.100.115.
I 991.990.992.982.983.
ReferenceBredael, 1982Bredael, 1982Nijs and Jacobs, 1981Sojak, Hrivnak, et al., 1973Sojak, Hrivnak, et al., 1973
Comment MSDC-RI MSDC-RI MSDC-RI MSDC-RI MSDC-RI
Column type CapillaryPackedCapillaryCapillaryCapillary
Active phase SqualaneSE-30Apiezon LApiezon LSqualane
Column length (m)  3.045.45.200.
Carrier gas     N2
Substrate
Column diameter (mm)   0.250.250.2
Phase thickness (μm)
Temperature (C) 86.100.100.120.115.
I 982.992.985.0985.7982.7
ReferenceSojak, Hrivnak, et al., 1973Bierl, Beroza, et al., 1972Eisen, Orav, et al., 1972Eisen, Orav, et al., 1972Soják and Bucinská, 1970
Comment MSDC-RI MSDC-RI MSDC-RI MSDC-RI MSDC-RI
Column type Capillary
Active phase Squalane
Column length (m) 200.
Carrier gas N2
Substrate
Column diameter (mm) 0.2
Phase thickness (μm)
Temperature (C) 86.
I 982.2
ReferenceSoják and Bucinská, 1970
Comment MSDC-RI

Kovats' RI, polar column, isothermal

Data compiled by: NIST Mass Spectrometry Data Center, William E. Wallace, director

Column type CapillaryCapillaryCapillaryCapillaryCapillary
Active phase PEG 4000PEG 4000PEG 4000PEG 4000PEG 4000
Column length (m)
Carrier gas
Substrate
Column diameter (mm)
Phase thickness (μm)
Temperature (C) 100.110.120.70.80.
I 1039.1040.1040.1037.1039.
ReferenceRang, Orav, et al., 1988Rang, Orav, et al., 1988Rang, Orav, et al., 1988Rang, Orav, et al., 1988Rang, Orav, et al., 1988
Comment MSDC-RI MSDC-RI MSDC-RI MSDC-RI MSDC-RI
Column type CapillaryCapillaryCapillaryCapillaryCapillary
Active phase PEG-20MPEG-20MPEG-20MPolyethylene Glycol 4000Polyethylene Glycol 4000
Column length (m)    80.80.
Carrier gas
Substrate
Column diameter (mm)    0.250.25
Phase thickness (μm)
Temperature (C) 100.110.90.100.120.
I 1035.1036.1035.1039.21040.3
ReferenceRang, Orav, et al., 1988Rang, Orav, et al., 1988Rang, Orav, et al., 1988Eisen, Orav, et al., 1972Eisen, Orav, et al., 1972
Comment MSDC-RI MSDC-RI MSDC-RI MSDC-RI MSDC-RI
Column type CapillaryCapillaryCapillaryCapillaryCapillary
Active phase Polyethylene Glycol 4000Polyethylene Glycol 4000PEG 4000PEG 4000PEG 4000
Column length (m) 80.80.80.80.80.
Carrier gas
Substrate
Column diameter (mm) 0.250.250.250.250.25
Phase thickness (μm)
Temperature (C) 70.80.100.120.70.
I 1037.31038.81039.21040.31037.3
ReferenceEisen, Orav, et al., 1972Eisen, Orav, et al., 1972Orav and Eisen, 1972Orav and Eisen, 1972Orav and Eisen, 1972
Comment MSDC-RI MSDC-RI MSDC-RI MSDC-RI MSDC-RI
Column type Capillary
Active phase PEG 4000
Column length (m) 80.
Carrier gas
Substrate
Column diameter (mm) 0.25
Phase thickness (μm)
Temperature (C) 80.
I 1038.8
ReferenceOrav and Eisen, 1972
Comment MSDC-RI

Phase change data

Data compiled by: William E. Acree, Jr., James S. Chickos

Enthalpy of vaporization

ΔvapH (kcal/mol) Temperature (K) Method Reference Comment
10.3413.AStephenson and Malanowski, 1987Based on data from 398. - 444. K.

References

Rang, Martinson, et al., 1974
Rang, S.; Martinson, E.; Muurisepp, M.,
Ionization potentials of unsaturated hydrocarbons. 1. n-Alkenes, Eesti NSV Teaduste Akadeemia Toimetised 23,
Eesti. NSV Tead. Akad. Toim., 1974, 352. [all data]
Krause, Taylor, et al., 1978
Krause, D.A.; Taylor, J.W.; Fenske, R.F.,
An analysis of the effects of alkyl substituents on the ionization potentials of n-alkenes,
J. Am. Chem. Soc., 1978, 100, 718. [all data]