Bicyclo[2.2.2]oct-2-ene,5-methylene-
- Formula: C9H12
- Molecular weight: 120.1916
- IUPAC Standard InChIKey: XERADROWVPYPEM-UHFFFAOYSA-N
- CAS Registry Number: 19386-05-1
- Chemical structure:
View 3d structure (requires JavaScript / HTML 5) - Permanent link for this species. Use this link for bookmarking this species for future reference.

Gas phase ion energetics data

Data compiled by: Sharon G. Lias, Rhoda D. Levin, and Sherif A. Kafafi
Ionization energy determinations
IE (eV) | Method | Reference | Comment |
---|---|---|---|
8.97 | PE | Asmus and Klessinger, 1974 | Vertical value |

Normal alkane RI, non-polar column, custom temperature program

Column type | Active phase | I | Reference | Comment |
---|---|---|---|---|
Capillary | Methyl Silicone | 783. | Zenkevich, 1998 | Program: not specified |

References

Asmus and Klessinger, 1974
Asmus, P.; Klessinger, M.,
Photoelectron spectra of organic compounds. VI. Exocyclic methylene compounds,
Tetrahedron, 1974, 30, 2477. [all data]
Zenkevich, 1998
Zenkevich, I.G.,
Non-Traditional Criteria for Gas-Chromatographic and Chromato-Mass-Spectrometric Identification of Organic Compounds,
Zh. Anal. Khim., 1998, 53, 8, 828-835. [all data]