Silane,trimethyl(2-phenylethenyl)-,(E)-
- Formula: C11H16Si
- Molecular weight: 176.3302
- IUPAC Standard InChIKey: FIONWRDVKJFHRC-MDZDMXLPSA-N
- CAS Registry Number: 19372-00-0
- Chemical structure:
View 3d structure (requires JavaScript / HTML 5) - Stereoisomers:

Gas phase ion energetics data

Data compiled by: Sharon G. Lias, Rhoda D. Levin, and Sherif A. Kafafi
Ionization energy determinations
IE (eV) | Method | Reference |
---|---|---|
7.89 ± 0.04 | EI | Benito, Seidl, et al., 1973 |

References

Benito, Seidl, et al., 1973
Benito, I.; Seidl, H.; Bock, H.,
Efectos electronicos y estericos de sustituyentes alquilicos y silicicos sobre el sistema electronico π del estireno,
Rev. Fac. Cienc. Univ. Oviedo, 1973, 14, 95. [all data]