Pyrrolidine,1-(1-buten-3-ynyl)-
- Formula: C8H11N
- Molecular weight: 121.1796
- IUPAC Standard InChIKey: JUSNSCZQAWXGCZ-ZZXKWVIFSA-N
- CAS Registry Number: 19352-85-3
- Chemical structure:
View 3d structure (requires JavaScript / HTML 5) - Permanent link for this species. Use this link for bookmarking this species for future reference.

Gas phase ion energetics data

Data compiled by: Henry M. Rosenstock, Keith Draxl, Bruce W. Steiner, and John T. Herron
Ionization energy determinations
IE (eV) | Method | Reference |
---|---|---|
7.5 | EI | Plotnikov, Bogolyubov, et al., 1969 |
Appearance energy determinations
Ion | AE (eV) | Other Products | Method | Reference | Comment |
---|---|---|---|---|---|
C4H3+ | 15.2 | ? | EI | Plotnikov, Bogolyubov, et al., 1969 | |
C4H3N+ | 15.3 | C4H8 | EI | Plotnikov, Bogolyubov, et al., 1969 | |
C4H4+ | 13.7 | ? | EI | Plotnikov, Bogolyubov, et al., 1969 | |
C5H4N+ | 15.0 | ? | EI | Plotnikov, Bogolyubov, et al., 1969 | |
C5H6N+ | 11.3 | CH2=CHCH2 | EI | Plotnikov, Bogolyubov, et al., 1969 | |
C8H10N+ | 10.7 | H | EI | Plotnikov, Bogolyubov, et al., 1969 |

References

Plotnikov, Bogolyubov, et al., 1969
Plotnikov, V.F.; Bogolyubov, G.M.; Maretina, I.A.; Petrov, A.A.,
Organic derivatives of elements of Groups V and VI. V. Mass spectra of 1-buten-3-ynylamines,
Zh. Org. Khim., 1969, 5, 1137, In original 1157. [all data]