Phosphoric triamide, N,N-dimethyl-
- Formula: C2H10N3OP
- Molecular weight: 123.0941
- IUPAC Standard InChIKey: MKRCVOZUOLJWFN-UHFFFAOYSA-N
- CAS Registry Number: 19316-37-1
- Chemical structure:
View 3d structure (requires JavaScript / HTML 5) - Permanent link for this species. Use this link for bookmarking this species for future reference.

Gas phase ion energetics data

Data compiled by: Sharon G. Lias, Rhoda D. Levin, and Sherif A. Kafafi
Ionization energy determinations
IE (eV) | Method | Reference |
---|---|---|
8.85 ± 0.05 | EI | Baldwin, Loudon, et al., 1977 |

References

Baldwin, Loudon, et al., 1977
Baldwin, M.A.; Loudon, A.G.; Webb, K.S.; Cardnell, P.C.,
Charge location and fragmentation under electron impact. V-The ionization potentials of (methylated) phosphoramides, guanidines, formamides, acetamides, ureas and thioureas,
Org. Mass Spectrom., 1977, 12, 279. [all data]