2,2-Propanediamine, N,N,N',N'-tetrafluoro-
- Formula: C3H6F4N2
- Molecular weight: 146.0868
- IUPAC Standard InChIKey: SHQNJKPGLCTKHG-UHFFFAOYSA-N
- CAS Registry Number: 19309-63-8
- Chemical structure:
View 3d structure (requires JavaScript / HTML 5) - Permanent link for this species. Use this link for bookmarking this species for future reference.

Gas phase ion energetics data

Data compiled by: Sharon G. Lias, Rhoda D. Levin, and Sherif A. Kafafi
Appearance energy determinations
Ion | AE (eV) | Other Products | Method | Reference | Comment |
---|---|---|---|---|---|
CHNF2+ | 13.2 ± 0.3 | ? | EI | Hertzberg, White, et al., 1972 | |
CH3+ | 14.7 ± 0.2 | ? | EI | Hertzberg, White, et al., 1972 | |
C2H6+ | 13.1 ± 0.2 | NF3+CNF? | EI | Hertzberg, White, et al., 1972 | |
C2H6NF2+ | 11.1 ± 0.3 | ? | EI | Hertzberg, White, et al., 1972 | |
C3H6N+ | 15.4 ± 0.3 | ? | EI | Hertzberg, White, et al., 1972 | |
NF+ | 13.9 ± 0.3 | ? | EI | Hertzberg, White, et al., 1972 | |
NF2+ | 13.9 ± 0.4 | ? | EI | Hertzberg, White, et al., 1972 |

References

Hertzberg, White, et al., 1972
Hertzberg, M.; White, G.; Olfky, R.S.; Saalfeld, F.E.,
Bisdifluoraminoalkanes: the mass spectral decomposition of isomeric propanes,
J. Phys. Chem., 1972, 76, 60. [all data]