p-Toluic acid, butyl ester
- Formula: C12H16O2
- Molecular weight: 192.2542
- IUPAC Standard InChIKey: UYGHRCCJWWYXMY-UHFFFAOYSA-N
- CAS Registry Number: 19277-56-6
- Chemical structure:
View 3d structure (requires JavaScript / HTML 5) - Other names: Benzoic acid, 4-methyl-, butyl ester; Butyl p-toluate

Gas phase ion energetics data

Data compiled by: Sharon G. Lias, Rhoda D. Levin, and Sherif A. Kafafi
Appearance energy determinations
Ion | AE (eV) | Other Products | Method | Reference | Comment |
---|---|---|---|---|---|
C8H8O2+ | 9.24 ± 0.06 | C4H8 | EI | Tajima, Yanagisawa, et al., 1980 | |
C8H9O2+ | 8.96 ± 0.06 | C4H7 | EI | Tajima, Yanagisawa, et al., 1980 |

References

Tajima, Yanagisawa, et al., 1980
Tajima, S.; Yanagisawa, T.; Azami, T.; Tsuchiya, T.,
Temperature effect on the single and double hydrogen atom transfer reactions in o-, m-, and p-toluic acid butyl esters,
Org. Mass Spectrom., 1980, 15, 609. [all data]