1,2:4,5-Dibenzopyrene
- Formula: C24H14
- Molecular weight: 302.3680
- IUPAC Standard InChIKey: KGHMWBNEMFNJFZ-UHFFFAOYSA-N
- CAS Registry Number: 192-65-4
- Chemical structure:
View 3d structure (requires JavaScript / HTML 5) - Other names: Naphtho[1,2,3,4-def]chrysene; Dibenzo[a,e]pyrene; Db(a,e)P; 1,2,4,5-Dibenzopyrene; 1,2:4,5-Dibenzpyrene; dibenz[a,e]pyrene; Naphtho[1,2,3,4-de]chrysene

Phase change data

Data compiled as indicated in comments:
TRC - Thermodynamics Research Center, NIST Boulder Laboratories, Chris Muzny director
AC - William E. Acree, Jr., James S. Chickos
Quantity | Value | Units | Method | Reference | Comment |
---|---|---|---|---|---|
Tfus | 520.2 | K | N/A | Casellato, Vecchi, et al., 1973 | Uncertainty assigned by TRC = 0.5 K; TRC |
Enthalpy of sublimation
ΔsubH (kJ/mol) | Temperature (K) | Method | Reference | Comment |
---|---|---|---|---|
146.4 | 429. | A | Stephenson and Malanowski, 1987 | Based on data from 414. to 506. K.; AC |
137.6 | 480. | ME | Wakayama and Inokuchi, 1967 | Based on data from 434. to 526. K.; AC |
Enthalpy of fusion
ΔfusH (kJ/mol) | Temperature (K) | Method | Reference | Comment |
---|---|---|---|---|
32.1 | 517.9 | DSC | Kestens, Auclair, et al., 2010 | AC |
30.5 | 520.2 | N/A | Acree, 1991 | AC |

Gas phase ion energetics data

Data compiled as indicated in comments:
LLK - Sharon G. Lias, Rhoda D. Levin, and Sherif A. Kafafi
RDSH - Henry M. Rosenstock, Keith Draxl, Bruce W. Steiner, and John T. Herron
Ionization energy determinations
IE (eV) | Method | Reference | Comment |
---|---|---|---|
7.11 | PE | Clar and Schmidt, 1979 | LLK |
7.41 | CTS | Briegleb, 1964 | RDSH |
7.27 | CTS | Birks and Stifkin, 1961 | RDSH |
7.20 | CTS | Matsen, 1956 | RDSH |

Kovats' RI, non-polar column, isothermal

Column type | Active phase | Temperature (C) | I | Reference | Comment |
---|---|---|---|---|---|
Packed | OV-101 | 270. | 3507. | Grimmer and Böhnke, 1976 | N2, Gas Chrom Q (100-120 mesh); Column length: 10. m |
Packed | OV-101 | 270. | 3507. | Grimmer and Böhnke, 1975 | Gas Chrom Q; Column length: 10. m |

Van Den Dool and Kratz RI, non-polar column, temperature ramp

Column type | Active phase | I | Reference | Comment |
---|---|---|---|---|
Capillary | SE-52 | 3540. | Beernaert, 1979 | He, 50. C @ 5. min, 6. K/min; Column length: 33.3 m; Column diameter: 0.50 mm; Tend: 320. C |

Normal alkane RI, non-polar column, custom temperature program

Column type | Active phase | I | Reference | Comment |
---|---|---|---|---|
Packed | OV-101 | 3507. | Kaliszan and Lamparczyk, 1978 | Program: not specified |

Lee's RI, non-polar column, temperature ramp

Column type | Active phase | I | Reference | Comment |
---|---|---|---|---|
Capillary | HP-5 | 555.26 | Pedersen, Durant, et al., 2005 | 30. m/0.25 mm/0.25 μm, Helium, 50. C @ 1.5 min, 6. K/min, 310. C @ 10. min |
Capillary | HP-5 | 551.53 | Marynowski, Pieta, et al., 2004 | 60. m/0.25 mm/0.25 μm, He, 3. K/min; Tstart: 35. C; Tend: 300. C |
Capillary | DB-5MS | 553.4 | Sauvain and Duc, 2004 | 30. m/0.25 mm/0.25 μm, 60. C @ 3. min, 5. K/min, 320. C @ 20. min |
Capillary | DB-5MS | 554.76 | Chen, Keeran, et al., 2002 | 30. m/0.25 mm/0.5 μm, 40. C @ 1. min, 4. K/min; Tend: 310. C |

Lee's RI, non-polar column, custom temperature program

Column type | Active phase | I | Reference | Comment |
---|---|---|---|---|
Capillary | HP-5MS | 551.65 | Wang, Li, et al., 2007 | 30. m/0.25 mm/0.25 μm, He; Program: 60C(2min) => 6C/min => 258C => 2C/min => 300C(4min) |
Capillary | HP-5MS | 551.53 | Wang, Li, et al., 2007, 2 | 30. m/0.25 mm/0.25 μm, He; Program: not specified |
Capillary | HP-5MS | 551.65 | Wang, Li, et al., 2007, 2 | 30. m/0.25 mm/0.25 μm, He; Program: not specified |
Capillary | DB-5 | 584.6 | Lundstedt, Haglund, et al., 2003 | 30. m/0.25 mm/0.25 μm; Program: not specified |
Capillary | 5 % Phenyl methyl siloxane | 551.53 | Allen J.O., Durant J.L., et al., 1998 | Program: not specified |
Capillary | SE-52 | 554.05 | Shlyakhov, 1984 | Program: not specified |

References

Casellato, Vecchi, et al., 1973
Casellato, F.; Vecchi, C.; Girell, A.,
Differential calorimetric study of polycyclic aromatic hydrocarbons,
Thermochim. Acta, 1973, 6, 4, 361, https://doi.org/10.1016/0040-6031(73)87003-0
. [all data]
Stephenson and Malanowski, 1987
Stephenson, Richard M.; Malanowski, Stanislaw,
Handbook of the Thermodynamics of Organic Compounds, 1987, https://doi.org/10.1007/978-94-009-3173-2
. [all data]
Wakayama and Inokuchi, 1967
Wakayama, Nobuko; Inokuchi, Hiroo,
Heats of Sublimation of Polycyclic Aromatic Hydrocarbons and Their Molecular Packings,
Bull. Chem. Soc. Jpn., 1967, 40, 10, 2267-2271, https://doi.org/10.1246/bcsj.40.2267
. [all data]
Kestens, Auclair, et al., 2010
Kestens, Vikram; Auclair, Guy; Drozdzewska, Katarzyna; Held, Andrea; Roebben, Gert; Linsinger, Thomas,
Thermodynamic property values of selected polycyclic aromatic hydrocarbons measured by differential scanning calorimetry,
J Therm Anal Calorim, 2010, 99, 1, 245-261, https://doi.org/10.1007/s10973-009-0440-6
. [all data]
Acree, 1991
Acree, William E.,
Thermodynamic properties of organic compounds: enthalpy of fusion and melting point temperature compilation,
Thermochimica Acta, 1991, 189, 1, 37-56, https://doi.org/10.1016/0040-6031(91)87098-H
. [all data]
Clar and Schmidt, 1979
Clar, E.; Schmidt, W.,
Correlations between photoelectron and UV absorption spectra of polycyclic hydrocarbons. The pyrene series,
Tetrahedron, 1979, 35, 1027. [all data]
Briegleb, 1964
Briegleb, G.,
Electron affinity of organic molecules,
Angew. Chem. Intern. Ed., 1964, 3, 617. [all data]
Birks and Stifkin, 1961
Birks, J.B.; Stifkin, M.A.,
π-Electronic excitation and ionization energies of condensed ring aromatic hydrocarbons,
Nature, 1961, 191, 761. [all data]
Matsen, 1956
Matsen, F.A.,
Electron affinities, methyl affinities, and ionization energies of condensed ring aromatic hydrocarbons,
J. Chem. Phys., 1956, 24, 602. [all data]
Grimmer and Böhnke, 1976
Grimmer, G.; Böhnke, H.,
Anreicherung und gas-chromatographische Profil-Analyse der polycyclischen aromatischen Kohlenwasserstoffe in Schmieröl,
Chromatographia, 1976, 9, 1, 30-40, https://doi.org/10.1007/BF02270595
. [all data]
Grimmer and Böhnke, 1975
Grimmer, G.; Böhnke, H.,
Polycyclic aromatic hydrocarbon profile analysis of high-protein foods, oils, and fats by gas chromatography,
J. Ass. Offic. Anal. Chem, 1975, 58, 4, 725-733. [all data]
Beernaert, 1979
Beernaert, H.,
Gas Chromatographic Analysis of Polyclylic Aromatic Hydrocarbons,
J. Chromatogr., 1979, 173, 1, 109-118, https://doi.org/10.1016/S0021-9673(01)80450-7
. [all data]
Kaliszan and Lamparczyk, 1978
Kaliszan, R.; Lamparczyk, H.,
A Relationship between the Connectivity Indices and Retention Indices of Polycyclic Aromatic Hydrocarbons,
J. Chromatogr. Sci., 1978, 16, 6, 246-248, https://doi.org/10.1093/chromsci/16.6.246
. [all data]
Pedersen, Durant, et al., 2005
Pedersen, D.U.; Durant, J.L.; Taghizadeh, K.; Hemond, H.F.; Lafleur, A.L.; Cass, G.R.,
Human cell mutagenes in respirable airborne particles from the Northeastern United States. 2. Quantification of mutagenes and other organic compounds.,
Environ. Sci. Technol., 2005, 39, 24, 9547-9560, https://doi.org/10.1021/es050886c
. [all data]
Marynowski, Pieta, et al., 2004
Marynowski, L.; Pieta, M.; Janeczek, J.,
Composition and source of polycyclic aromatic compounds in deposited dust from selected sites around the Upper Silesia, Poland,
Geol. Q., 2004, 48, 2, 169-180. [all data]
Sauvain and Duc, 2004
Sauvain, J.-J.; Duc, T.V.,
Approaches to identifying and quantifying polycyclic aromatic hydrocarbons of molecular weight 302 in diesel particulates,
J. Sep. Sci., 2004, 27, 1-2, 78-88, https://doi.org/10.1002/jssc.200301620
. [all data]
Chen, Keeran, et al., 2002
Chen, P.H.; Keeran, W.S.; Van Ausdale, W.A.; Schindler, D.R.; Roberts, D.W.,
Application of Lee retention indices to the confirmation of tentatively identified compounds from GC/MS analysis of environmental samples, Technical paper, Analytical Services Division, Environmental ScienceEngineering, Inc, PO Box 1703, Gainesville, FL 32602, 2002, 11. [all data]
Wang, Li, et al., 2007
Wang, Z.; Li, K.; Lambert, P.; Yang, C.,
Identification, characterization and quantitation of pyrogenic polycylic aromatic hydrocarbons and other organic compounds in tire fire products,
J. Chromatogr. A, 2007, 1139, 1, 14-26, https://doi.org/10.1016/j.chroma.2006.10.085
. [all data]
Wang, Li, et al., 2007, 2
Wang, Z.; Li, K.; Lambert, P.; Brown, C.E.; Yang, C.; Hollebone, B.P.,
Identification and characterization of polycyclic aromatic compounds in tire fire products and differentiation of pyrogenic PAHs from petrogenic PAHs
in Proceedings of the 30th Arctic and Marine Oilspill (AMOP) Technical Seminar. Vol.1, 2007, 61-85. [all data]
Lundstedt, Haglund, et al., 2003
Lundstedt, S.; Haglund, P.; Öberg, L.,
Degradation and formation of polycyclic aromatic compounds during bioslurry treatment of an aged gasworks soil,
Environ. Toxicol. Chem., 2003, 22, 7, 1413-1420, https://doi.org/10.1002/etc.5620220701
. [all data]
Allen J.O., Durant J.L., et al., 1998
Allen J.O.; Durant J.L.; Dookeran N.M.; Taghizadeh K.; Plummer E.F.; Lafleur A.L.; Sarofim A.F.; Smith K.A.,
Measurement of C24H14 polycyclic aromatic hydrocarbons associated with a size-segregated urban aerosol,
Environ. Sci. Technol., 1998, 32, 13, 1928-1932, https://doi.org/10.1021/es970919r
. [all data]
Shlyakhov, 1984
Shlyakhov, A.F.,
Gas chromatography in organic geochemistry, Nedra, Moscow, 1984, 221. [all data]