Dibenzo(h,rst)pentaphene
- Formula: C28H16
- Molecular weight: 352.4266
- IUPAC Standard InChIKey: LMNAZSSKDBUVFA-UHFFFAOYSA-N
- CAS Registry Number: 192-47-2
- Chemical structure:
View 3d structure (requires JavaScript / HTML 5) - Other names: Tribenzo(a,e,i)pyrene; (1,2:4,5:7,8)-Tribenzopyrene

Phase change data

Data compiled by: Thermodynamics Research Center, NIST Boulder Laboratories, Chris Muzny director
Quantity | Value | Units | Method | Reference | Comment |
---|---|---|---|---|---|
Tfus | 608. | K | N/A | Smith, 1980 | Uncertainty assigned by TRC = 1. K |

Gas phase ion energetics data

Data compiled as indicated in comments:
LLK - Sharon G. Lias, Rhoda D. Levin, and Sherif A. Kafafi
RDSH - Henry M. Rosenstock, Keith Draxl, Bruce W. Steiner, and John T. Herron
Ionization energy determinations
IE (eV) | Method | Reference | Comment |
---|---|---|---|
6.99 | PE | Clar and Schmidt, 1979 | LLK |
7.38 | CTS | Briegleb, 1964 | RDSH |
7.17 | CTS | Matsen, 1956 | RDSH |

References

Smith, 1980
Smith, G.W.,
Phase behavior of some condensed polycyclic aromatics,
Mol. Cryst. Liq. Cryst., 1980, 64, 15. [all data]
Clar and Schmidt, 1979
Clar, E.; Schmidt, W.,
Correlations between photoelectron and UV absorption spectra of polycyclic hydrocarbons. The pyrene series,
Tetrahedron, 1979, 35, 1027. [all data]
Briegleb, 1964
Briegleb, G.,
Electron affinity of organic molecules,
Angew. Chem. Intern. Ed., 1964, 3, 617. [all data]
Matsen, 1956
Matsen, F.A.,
Electron affinities, methyl affinities, and ionization energies of condensed ring aromatic hydrocarbons,
J. Chem. Phys., 1956, 24, 602. [all data]
Clar, 1949
Clar, E.,
J. Chem. Soc., 1949, 2168. [all data]