Molybdenum,pentacarbonyl(triphenylarsine)-
- Formula: C23H15AsMoO5
- Molecular weight: 542.24
- CAS Registry Number: 19212-22-7

Gas phase ion energetics data

Data compiled by: Sharon G. Lias, Rhoda D. Levin, and Sherif A. Kafafi
Ionization energy determinations
IE (eV) | Method | Reference |
---|---|---|
7.80 ± 0.05 | EI | Paetzold and Abd-el-Mottaleb, 1975 |

References

Paetzold and Abd-el-Mottaleb, 1975
Paetzold, R.; Abd-el-Mottaleb, S.,
Correlative studies of some spectroscopic and bonding parameters in octahedrally coordinated metal carbonyl complexes,
J. Mol. Struct., 1975, 24, 357. [all data]