Molybdenum, pentacarbonyl(phosphorus trichloride)-

Gas phase ion energetics data

Data compiled as indicated in comments:
LLK - Sharon G. Lias, Rhoda D. Levin, and Sherif A. Kafafi
RDSH - Henry M. Rosenstock, Keith Draxl, Bruce W. Steiner, and John T. Herron

Ionization energy determinations

IE (eV) Method Reference Comment
8.25EIPignataro, Foffani, et al., 1968RDSH
8.36PEDaamen, Boxhoorn, et al., 1978Vertical value; LLK

References

Pignataro, Foffani, et al., 1968
Pignataro, S.; Foffani, A.; Innorta, G.; Distefano, G., Mass spectra and ionization potentials of group VI-B substituted transition-metal carbonyls, Advan. Mass Spectrom., 1968, 4, 323. [all data]

Daamen, Boxhoorn, et al., 1978
Daamen, H.; Boxhoorn, G.; Oskam, A., U. V. photoelectron (He I and He II) studies of M(CO)5PX3 (M=Cr, Mo, W and X=F, Cl, Br), Inorg. Chim. Acta, 1978, 28, 263. [all data]