N-(2-Methylphenyl)azetidine
- Formula: C10H13N
- Molecular weight: 147.2169
- IUPAC Standard InChIKey: HHMHFJCTAJMWOO-UHFFFAOYSA-N
- CAS Registry Number: 19198-94-8
- Chemical structure:
View 3d structure (requires JavaScript / HTML 5) - Permanent link for this species. Use this link for bookmarking this species for future reference.

Gas phase ion energetics data

Data compiled as indicated in comments:
LBLHLM - Sharon G. Lias, John E. Bartmess, Joel F. Liebman, John L. Holmes, Rhoda D. Levin, and W. Gary Mallard
Ionization energy determinations
IE (eV) | Method | Reference | Comment |
---|---|---|---|
7.1 ± 0.1 | PE | Rozeboom, Houk, et al., 1982 | LBLHLM |
7.67 ± 0.06 | PE | Rozeboom, Houk, et al., 1982 | Vertical value; LBLHLM |

References

Rozeboom, Houk, et al., 1982
Rozeboom, M.D.; Houk, K.N.; Searles, S.; Seyedrezai, S.E.,
Photoelectron spectroscopy of N-aryl cyclic amines. Variable conformations and relationships to gas- and solution-phase basicities,
J. Am. Chem. Soc., 1982, 104, 3448. [all data]