Pyridazine,1,2-dioxide
- Formula: C4H4N2O2
- Molecular weight: 112.0868
- IUPAC Standard InChIKey: WMIWORNOFRCAKP-UHFFFAOYSA-N
- CAS Registry Number: 19194-87-7
- Chemical structure:
View 3d structure (requires JavaScript / HTML 5) - Permanent link for this species. Use this link for bookmarking this species for future reference.

Gas phase ion energetics data

Data compiled by: Sharon G. Lias, Rhoda D. Levin, and Sherif A. Kafafi
Ionization energy determinations
IE (eV) | Method | Reference | Comment |
---|---|---|---|
8.51 ± 0.02 | PE | Maier, Muller, et al., 1975 | Vertical value |

References

Maier, Muller, et al., 1975
Maier, J.P.; Muller, J.-F.; Kubota, T.,
182. Ionisation energies and the electronic structures of the N-oxides of diazabenzenes,
Helv. Chim. Acta, 1975, 58, 1634. [all data]