Dibenzo[a,j]perylene
- Formula: C28H16
- Molecular weight: 352.4266
- IUPAC Standard InChIKey: GCANSAYVHQONFB-UHFFFAOYSA-N
- CAS Registry Number: 191-87-7
- Chemical structure:
View 3d structure (requires JavaScript / HTML 5) - Permanent link for this species. Use this link for bookmarking this species for future reference.

Gas phase ion energetics data

Data compiled as indicated in comments:
LLK - Sharon G. Lias, Rhoda D. Levin, and Sherif A. Kafafi
RDSH - Henry M. Rosenstock, Keith Draxl, Bruce W. Steiner, and John T. Herron
Ionization energy determinations
IE (eV) | Method | Reference | Comment |
---|---|---|---|
6.70 | CTS | Briegleb, 1964 | RDSH |
6.34 | CTS | Matsen, 1956 | RDSH |
6.51 | PE | Clar and Schmidt, 1977 | Vertical value; LLK |

References

Briegleb, 1964
Briegleb, G.,
Electron affinity of organic molecules,
Angew. Chem. Intern. Ed., 1964, 3, 617. [all data]
Matsen, 1956
Matsen, F.A.,
Electron affinities, methyl affinities, and ionization energies of condensed ring aromatic hydrocarbons,
J. Chem. Phys., 1956, 24, 602. [all data]
Clar and Schmidt, 1977
Clar, E.; Schmidt, W.,
Correlations between photoelectron and ultraviolet absorption spectra of polycyclic hydrocarbons. The perylene, coronene and bisanthene series,
Tetrahedron, 1977, 33, 2093. [all data]
Clar, 1949
Clar, E.,
Chem. Ber., 1949, 82, 46. [all data]