Boronic acid, methyldithio-, dimethyl ester
- Formula: C3H9BS2
- Molecular weight: 120.045
- IUPAC Standard InChIKey: NOBDZFNHAVAGLK-UHFFFAOYSA-N
- CAS Registry Number: 19163-08-7
- Chemical structure:
View 3d structure (requires JavaScript / HTML 5) - Permanent link for this species. Use this link for bookmarking this species for future reference.

Phase change data

Data compiled by: William E. Acree, Jr., James S. Chickos
Enthalpy of vaporization
ΔvapH (kJ/mol) | Temperature (K) | Reference | Comment |
---|---|---|---|
44.7 | 315. | Dykyj, Svoboda, et al., 1999 | Based on data from 300. to 373. K. |

Gas phase ion energetics data

Data compiled by: Sharon G. Lias, Rhoda D. Levin, and Sherif A. Kafafi
Ionization energy determinations
IE (eV) | Method | Reference | Comment |
---|---|---|---|
8.74 | PE | Kroner, Nolle, et al., 1973 | Vertical value |

References

Dykyj, Svoboda, et al., 1999
Dykyj, J.; Svoboda, J.; Wilhoit, R.C.; Frenkel, M.L.; Hall, K.R.,
Vapor Pressure of Chemicals: Part A. Vapor Pressure and Antoine Constants for Hydrocarbons and Sulfur, Selenium, Tellurium and Hydrogen Containing Organic Compounds, Springer, Berlin, 1999, 373. [all data]
Kroner, Nolle, et al., 1973
Kroner, J.; Nolle, D.; Noth, H.,
Photoelektronenspektroskopische untersuchungen an bor-verbindungen, I Orbitalreihenfolgen und ladungsdichten in methylthiound methoxyborane,
Z. Naturforsch. B:, 1973, 28, 416. [all data]